☠ Buildbot (Python): python/cpython - failed test (failure) (main)
The Buildbot has detected a new failure on builder s390x Fedora Rawhide LTO 3.x while building python/cpython. Full details are available at: https://buildbot.python.org/all/#/builders/323/builds/2887
Buildbot URL: https://buildbot.python.org/all/
Worker for this Build: edelsohn-fedora-rawhide-z
Build Reason: <unknown> Blamelist: Adam Turner <9087854+AA-Turner@users.noreply.github.com>, Alex Waygood <Alex.Waygood@Gmail.com>, Alexandru Mărășteanu <alexei@users.noreply.github.com>, Barney Gale <barney.gale@gmail.com>, Brandt Bucher <brandtbucher@microsoft.com>, Daniele Procida <daniele@vurt.org>, Eric Snow <ericsnowcurrently@gmail.com>, Erlend E. Aasland <erlend@python.org>, Gertjan van Zwieten <git@gjvz.nl>, Guido van Rossum <guido@python.org>, Hugo van Kemenade <hugovk@users.noreply.github.com>, Irit Katriel <1055913+iritkatriel@users.noreply.github.com>, Ivin Lee <62840497+rdrf2838@users.noreply.github.com>, James Hilton-Balfe <gobot1234yt@gmail.com>, Kamil Turek <kamil.turek@hotmail.com>, Kumar Aditya <kumaraditya@python.org>, Mark Shannon <mark@hotpy.org>, Nikita Sobolev <mail@sobolevn.me>, Pablo Galindo Salgado <Pablogsal@gmail.com>, Pieter Eendebak <pieter.eendebak@gmail.com>, Serhiy Storchaka <storchaka@gmail.com>, Terry Jan Reedy <tjreedy@udel.edu>, Tian Gao <gaogaotiantian@hotmail.com>, Tomas R <tomas.roun8@gmail.com>, cocoatomo <cocoatomo77@gmail.com>
BUILD FAILED: failed test (failure)
Summary of the results of the build (if available):
== Tests result: FAILURE then FAILURE ==
430 tests OK.
10 slowest tests:
- test_concurrent_futures: 2 min 14 sec
- test_multiprocessing_spawn: 1 min 28 sec
- test_signal: 1 min 15 sec
- test_multiprocessing_forkserver: 1 min 9 sec
- test_multiprocessing_fork: 1 min 3 sec
- test_socket: 42.1 sec
- test_math: 40.6 sec
- test_io: 32.4 sec
- test_imaplib: 31.9 sec
- test_subprocess: 28.1 sec
1 test failed: test_tools
16 tests skipped: test.test_asyncio.test_windows_events test.test_asyncio.test_windows_utils test_devpoll test_gdb test_ioctl test_kqueue test_launcher test_perf_profiler test_startfile test_tkinter test_ttk test_winconsoleio test_winreg test_winsound test_wmi test_zipfile64
1 re-run test: test_tools
Total duration: 8 min 32 sec
Captured traceback
Traceback (most recent call last):
File "/home/dje/cpython-buildarea/3.x.edelsohn-fedora-rawhide-z.lto/build/Lib/test/test_tools/test_freeze.py", line 27, in test_freeze_simple_script
outdir, scriptfile, python = helper.prepare(script, outdir)
^^^^^^^^^^^^^^^^^^^^^^^^^^^^^^
File "/home/dje/cpython-buildarea/3.x.edelsohn-fedora-rawhide-z.lto/build/Tools/freeze/test/freeze.py", line 146, in prepare
copy_source_tree(srcdir, SRCDIR)
File "/home/dje/cpython-buildarea/3.x.edelsohn-fedora-rawhide-z.lto/build/Tools/freeze/test/freeze.py", line 95, in copy_source_tree
shutil.copytree(oldroot, newroot, ignore=ignore_non_src)
File "/home/dje/cpython-buildarea/3.x.edelsohn-fedora-rawhide-z.lto/build/Lib/shutil.py", line 588, in copytree
return _copytree(entries=entries, src=src, dst=dst, symlinks=symlinks,
^^^^^^^^^^^^^^^^^^^^^^^^^^^^^^^^^^^^^^^^^^^^^^^^^^^^^^^^^^^^^^^
File "/home/dje/cpython-buildarea/3.x.edelsohn-fedora-rawhide-z.lto/build/Lib/shutil.py", line 542, in _copytree
raise Error(errors)
shutil.Error: [('/home/dje/cpython-buildarea/3.x.edelsohn-fedora-rawhide-z.lto/build/build/test_python_1449968æ/test_python_worker_1468106æ/@test_1468106_tmpæ-tardir/extractall_ctrl/ustar/fifotype', '/tmp/test_python__xixthap/tmp4itax4kf/cpython/build/test_python_1449968æ/test_python_worker_1468106æ/@test_1468106_tmpæ-tardir/extractall_ctrl/ustar/fifotype', '/home/dje/cpython-buildarea/3.x.edelsohn-fedora-rawhide-z.lto/build/build/test_python_1449968æ/test_python_worker_1468106æ/@test_1468106_tmpæ-tardir/extractall_ctrl/ustar/fifotype is a named pipe'), ('/home/dje/cpython-buildarea/3.x.edelsohn-fedora-rawhide-z.lto/build/build/test_python_1449968æ/test_python_worker_1468106æ/@test_1468106_tmpæ-tardir/extractall_none/ustar/fifotype', '/tmp/test_python__xixthap/tmp4itax4kf/cpython/build/test_python_1449968æ/test_python_worker_1468106æ/@test_1468106_tmpæ-tardir/extractall_none/ustar/fifotype', '/home/dje/cpython-buildarea/3.x.edelsohn-fedora-rawhide-z.lto/build/build/ test_python_1449968æ/test_python_worker_1468106æ/@test_1468106_tmpæ-tardir/extractall_none/ustar/fifotype is a named pipe'), ('/home/dje/cpython-buildarea/3.x.edelsohn-fedora-rawhide-z.lto/build/build/test_python_1449968æ/test_python_worker_1468440æ', '/tmp/test_python__xixthap/tmp4itax4kf/cpython/build/test_python_1449968æ/test_python_worker_1468440æ', "[Errno 2] No such file or directory: '/home/dje/cpython-buildarea/3.x.edelsohn-fedora-rawhide-z.lto/build/build/test_python_1449968æ/test_python_worker_1468440æ'")]
Traceback (most recent call last): File "/home/dje/cpython-buildarea/3.x.edelsohn-fedora-rawhide-z.lto/build/Lib/test/test_tools/test_freeze.py", line 27, in test_freeze_simple_script outdir, scriptfile, python = helper.prepare(script, outdir) ^^^^^^^^^^^^^^^^^^^^^^^^^^^^^^ File "/home/dje/cpython-buildarea/3.x.edelsohn-fedora-rawhide-z.lto/build/Tools/freeze/test/freeze.py", line 180, in prepare _run_quiet([MAKE, '-C', builddir, parallel]) File "/home/dje/cpython-buildarea/3.x.edelsohn-fedora-rawhide-z.lto/build/Tools/freeze/test/freeze.py", line 25, in _run_quiet return subprocess.run( ^^^^^^^^^^^^^^^ File "/home/dje/cpython-buildarea/3.x.edelsohn-fedora-rawhide-z.lto/build/Lib/subprocess.py", line 571, in run raise CalledProcessError(retcode, process.args, subprocess.CalledProcessError: Command '['/usr/bin/make', '-C', '/tmp/tmpge5aetgl/python-build', '-j2']' returned non-zero exit status 2.
Test report
Failed tests:
- test_tools
Failed subtests:
- test_freeze_simple_script - test.test_tools.test_freeze.TestFreeze.test_freeze_simple_script
Sincerely, -The BuildbotThe Buildbot has detected a new failure on builder AMD64 Windows11 Non-Debug 3.x while building python/cpython. Full details are available at: https://buildbot.python.org/all/#/builders/914/builds/2698
Buildbot URL: https://buildbot.python.org/all/
Worker for this Build: ware-win11
Build Reason: <unknown> Blamelist: Adam Turner <9087854+AA-Turner@users.noreply.github.com>, Alex Waygood <Alex.Waygood@Gmail.com>, Erlend E. Aasland <erlend@python.org>, Gertjan van Zwieten <git@gjvz.nl>, Kamil Turek <kamil.turek@hotmail.com>, Nikita Sobolev <mail@sobolevn.me>, Serhiy Storchaka <storchaka@gmail.com>, Tomas R <tomas.roun8@gmail.com>
BUILD FAILED: failed test (failure)
Summary of the results of the build (if available):
== Tests result: FAILURE then SUCCESS ==
417 tests OK.
10 slowest tests:
- test_peg_generator: 3 min 27 sec
- test_mmap: 2 min 7 sec
- test_multiprocessing_spawn: 2 min 1 sec
- test_io: 1 min 20 sec
- test_largefile: 1 min 9 sec
- test_socket: 1 min 6 sec
- test_math: 52.4 sec
- test_urllib2_localnet: 36.5 sec
- test_venv: 34.5 sec
- test_imaplib: 33.1 sec
30 tests skipped: test.test_asyncio.test_unix_events test_curses test_dbm_gnu test_dbm_ndbm test_devpoll test_epoll test_fcntl test_fork1 test_gdb test_grp test_ioctl test_kqueue test_multiprocessing_fork test_multiprocessing_forkserver test_openpty test_perf_profiler test_perfmaps test_poll test_posix test_pty test_pwd test_readline test_resource test_syslog test_threadsignals test_wait3 test_wait4 test_xxtestfuzz test_zipfile64 test_zoneinfo
1 re-run test: test_concurrent_futures
Total duration: 31 min 34 sec
Captured traceback
Traceback (most recent call last): File "b:\uildarea\3.x.ware-win11.nondebug\build\Lib\test\support\__init__.py", line 208, in _force_run return func(*args) ^^^^^^^^^^^ PermissionError: [WinError 32] The process cannot access the file because it is being used by another process: 'B:\\uildarea\\3.x.ware-win11.nondebug\\build\\build\\test_python_10508�\\test_python_worker_8964�'
Traceback (most recent call last): File "b:\uildarea\3.x.ware-win11.nondebug\build\Lib\test\support\os_helper.py", line 480, in temp_dir yield path File "b:\uildarea\3.x.ware-win11.nondebug\build\Lib\test\support\os_helper.py", line 533, in temp_cwd yield cwd_dir File "b:\uildarea\3.x.ware-win11.nondebug\build\Lib\test\libregrtest\main.py", line 758, in main self._main(tests, kwargs) File "b:\uildarea\3.x.ware-win11.nondebug\build\Lib\test\libregrtest\main.py", line 817, in _main sys.exit(0) SystemExit: 0
Test report
Failed tests:
- test_concurrent_futures
Sincerely, -The BuildbotThe Buildbot has detected a new failure on builder s390x Fedora Rawhide Clang 3.x while building python/cpython. Full details are available at: https://buildbot.python.org/all/#/builders/566/builds/3448
Buildbot URL: https://buildbot.python.org/all/
Worker for this Build: edelsohn-fedora-rawhide-z
Build Reason: <unknown> Blamelist: Erlend E. Aasland <erlend@python.org>, Gertjan van Zwieten <git@gjvz.nl>, Serhiy Storchaka <storchaka@gmail.com>
BUILD FAILED: failed test (failure)
Summary of the results of the build (if available):
== Tests result: FAILURE then FAILURE ==
430 tests OK.
10 slowest tests:
- test_concurrent_futures: 2 min 20 sec
- test_multiprocessing_spawn: 1 min 55 sec
- test_math: 1 min 37 sec
- test_multiprocessing_forkserver: 1 min 18 sec
- test_multiprocessing_fork: 1 min 4 sec
- test_signal: 56.3 sec
- test_capi: 50.7 sec
- test_socket: 45.3 sec
- test_subprocess: 42.6 sec
- test_unparse: 40.9 sec
1 test failed: test_tools
16 tests skipped: test.test_asyncio.test_windows_events test.test_asyncio.test_windows_utils test_devpoll test_gdb test_ioctl test_kqueue test_launcher test_perf_profiler test_startfile test_tkinter test_ttk test_winconsoleio test_winreg test_winsound test_wmi test_zipfile64
1 re-run test: test_tools
Total duration: 7 min 44 sec
Captured traceback
Traceback (most recent call last): File "/home/dje/cpython-buildarea/3.x.edelsohn-fedora-rawhide-z.clang/build/Lib/test/test_tools/test_freeze.py", line 27, in test_freeze_simple_script outdir, scriptfile, python = helper.prepare(script, outdir) ^^^^^^^^^^^^^^^^^^^^^^^^^^^^^^ File "/home/dje/cpython-buildarea/3.x.edelsohn-fedora-rawhide-z.clang/build/Tools/freeze/test/freeze.py", line 184, in prepare _run_quiet([MAKE, '-C', builddir, 'install']) File "/home/dje/cpython-buildarea/3.x.edelsohn-fedora-rawhide-z.clang/build/Tools/freeze/test/freeze.py", line 25, in _run_quiet return subprocess.run( ^^^^^^^^^^^^^^^ File "/home/dje/cpython-buildarea/3.x.edelsohn-fedora-rawhide-z.clang/build/Lib/subprocess.py", line 571, in run raise CalledProcessError(retcode, process.args, subprocess.CalledProcessError: Command '['/usr/bin/make', '-C', '/tmp/tmpaje_feqq/python-build', 'install']' returned non-zero exit status 2.
Traceback (most recent call last):
File "/home/dje/cpython-buildarea/3.x.edelsohn-fedora-rawhide-z.clang/build/Lib/test/test_tools/test_freeze.py", line 27, in test_freeze_simple_script
outdir, scriptfile, python = helper.prepare(script, outdir)
^^^^^^^^^^^^^^^^^^^^^^^^^^^^^^
File "/home/dje/cpython-buildarea/3.x.edelsohn-fedora-rawhide-z.clang/build/Tools/freeze/test/freeze.py", line 146, in prepare
copy_source_tree(srcdir, SRCDIR)
File "/home/dje/cpython-buildarea/3.x.edelsohn-fedora-rawhide-z.clang/build/Tools/freeze/test/freeze.py", line 95, in copy_source_tree
shutil.copytree(oldroot, newroot, ignore=ignore_non_src)
File "/home/dje/cpython-buildarea/3.x.edelsohn-fedora-rawhide-z.clang/build/Lib/shutil.py", line 588, in copytree
return _copytree(entries=entries, src=src, dst=dst, symlinks=symlinks,
^^^^^^^^^^^^^^^^^^^^^^^^^^^^^^^^^^^^^^^^^^^^^^^^^^^^^^^^^^^^^^^
File "/home/dje/cpython-buildarea/3.x.edelsohn-fedora-rawhide-z.clang/build/Lib/shutil.py", line 542, in _copytree
raise Error(errors)
shutil.Error: [('/home/dje/cpython-buildarea/3.x.edelsohn-fedora-rawhide-z.clang/build/build/test_python_1322171æ/test_python_worker_1333546æ/@test_1333546_tmpæ-tardir/extractall_ctrl/ustar/fifotype', '/tmp/test_python_n2txkegd/tmp0j8qpwi2/cpython/build/test_python_1322171æ/test_python_worker_1333546æ/@test_1333546_tmpæ-tardir/extractall_ctrl/ustar/fifotype', '/home/dje/cpython-buildarea/3.x.edelsohn-fedora-rawhide-z.clang/build/build/test_python_1322171æ/test_python_worker_1333546æ/@test_1333546_tmpæ-tardir/extractall_ctrl/ustar/fifotype is a named pipe'), ('/home/dje/cpython-buildarea/3.x.edelsohn-fedora-rawhide-z.clang/build/build/test_python_1322171æ/test_python_worker_1333546æ/@test_1333546_tmpæ-tardir/extractall_none/ustar/fifotype', '/tmp/test_python_n2txkegd/tmp0j8qpwi2/cpython/build/test_python_1322171æ/test_python_worker_1333546æ/@test_1333546_tmpæ-tardir/extractall_none/ustar/fifotype', '/home/dje/cpython-buildarea/3.x.edelsohn-fedora-rawhide-z.clang/buil d/build/test_python_1322171æ/test_python_worker_1333546æ/@test_1333546_tmpæ-tardir/extractall_none/ustar/fifotype is a named pipe')]
Test report
Failed tests:
- test_tools
Failed subtests:
- test_freeze_simple_script - test.test_tools.test_freeze.TestFreeze.test_freeze_simple_script
Sincerely, -The BuildbotThe Buildbot has detected a new failure on builder s390x Fedora Rawhide 3.x while building python/cpython. Full details are available at: https://buildbot.python.org/all/#/builders/538/builds/3459
Buildbot URL: https://buildbot.python.org/all/
Worker for this Build: edelsohn-fedora-rawhide-z
Build Reason: <unknown> Blamelist: Erlend E. Aasland <erlend@python.org>, Gertjan van Zwieten <git@gjvz.nl>, Serhiy Storchaka <storchaka@gmail.com>
BUILD FAILED: failed test (failure)
Summary of the results of the build (if available):
== Tests result: FAILURE then FAILURE ==
430 tests OK.
10 slowest tests:
- test_math: 2 min 37 sec
- test_concurrent_futures: 2 min 37 sec
- test_tools: 2 min 27 sec
- test_multiprocessing_spawn: 2 min 19 sec
- test_multiprocessing_forkserver: 1 min 37 sec
- test_capi: 1 min 14 sec
- test_multiprocessing_fork: 1 min 14 sec
- test_tokenize: 1 min
- test_socket: 52.2 sec
- test_signal: 49.7 sec
1 test failed: test_tools
16 tests skipped: test.test_asyncio.test_windows_events test.test_asyncio.test_windows_utils test_devpoll test_gdb test_ioctl test_kqueue test_launcher test_perf_profiler test_startfile test_tkinter test_ttk test_winconsoleio test_winreg test_winsound test_wmi test_zipfile64
7 re-run tests: test.test_asyncio.test_buffered_proto test_array test_c_locale_coercion test_cprofile test_socket test_tools test_venv
Total duration: 9 min 25 sec
Captured traceback
Traceback (most recent call last): File "/home/dje/cpython-buildarea/3.x.edelsohn-fedora-rawhide-z/build/Lib/test/test_socket.py", line 3863, in testCmsgTruncLen0Minus1 self.checkTruncatedHeader(self.doRecvmsg(self.serv_sock, len(MSG), File "/home/dje/cpython-buildarea/3.x.edelsohn-fedora-rawhide-z/build/Lib/test/test_socket.py", line 3817, in checkTruncatedHeader self.assertEqual(msg, MSG) AssertionError: b'' != b'Michael Gilfix was here\xe1\x88\xb4\r\n'
Traceback (most recent call last): File "/home/dje/cpython-buildarea/3.x.edelsohn-fedora-rawhide-z/build/Lib/test/test_venv.py", line 769, in nicer_error yield File "/home/dje/cpython-buildarea/3.x.edelsohn-fedora-rawhide-z/build/Lib/test/test_venv.py", line 705, in do_test_with_pip self.run_with_capture(venv.create, self.env_dir, File "/home/dje/cpython-buildarea/3.x.edelsohn-fedora-rawhide-z/build/Lib/test/test_venv.py", line 87, in run_with_capture func(*args, **kwargs) File "/home/dje/cpython-buildarea/3.x.edelsohn-fedora-rawhide-z/build/Lib/venv/__init__.py", line 469, in create builder.create(env_dir) File "/home/dje/cpython-buildarea/3.x.edelsohn-fedora-rawhide-z/build/Lib/venv/__init__.py", line 76, in create self._setup_pip(context) File "/home/dje/cpython-buildarea/3.x.edelsohn-fedora-rawhide-z/build/Lib/venv/__init__.py", line 359, in _setup_pip self._call_new_python(context, '-m', 'ensurepip', '--upgrade', File "/home/dje/cpython-buildarea/3.x.edelsohn-fedora-rawhide-z/build/Lib/venv/__init__.py", line 355, in _call_new_python subprocess.check_output(args, **kwargs) File "/home/dje/cpython-buildarea/3.x.edelsohn-fedora-rawhide-z/build/Lib/subprocess.py", line 466, in check_output return run(*popenargs, stdout=PIPE, timeout=timeout, check=True, ^^^^^^^^^^^^^^^^^^^^^^^^^^^^^^^^^^^^^^^^^^^^^^^^^^^^^^^^^ File "/home/dje/cpython-buildarea/3.x.edelsohn-fedora-rawhide-z/build/Lib/subprocess.py", line 571, in run raise CalledProcessError(retcode, process.args, subprocess.CalledProcessError: Command '['/tmp/test_python_h4a2_lpt/tmpmzhunqnk/bin/python', '-m', 'ensurepip', '--upgrade', '--default-pip']' returned non-zero exit status 1.
Traceback (most recent call last): File "/home/dje/cpython-buildarea/3.x.edelsohn-fedora-rawhide-z/build/Lib/test/test_socket.py", line 3897, in testCmsgTruncLen0 self.checkTruncatedArray(ancbuf=socket.CMSG_LEN(0), maxdata=0) File "/home/dje/cpython-buildarea/3.x.edelsohn-fedora-rawhide-z/build/Lib/test/test_socket.py", line 3879, in checkTruncatedArray self.assertEqual(msg, MSG) AssertionError: b'' != b'Michael Gilfix was here\xe1\x88\xb4\r\n'
Traceback (most recent call last): File "/home/dje/cpython-buildarea/3.x.edelsohn-fedora-rawhide-z/build/Lib/test/test_socket.py", line 3903, in testCmsgTruncLen0Plus1 self.checkTruncatedArray(ancbuf=socket.CMSG_LEN(0) + 1, maxdata=1) File "/home/dje/cpython-buildarea/3.x.edelsohn-fedora-rawhide-z/build/Lib/test/test_socket.py", line 3879, in checkTruncatedArray self.assertEqual(msg, MSG) AssertionError: b'' != b'Michael Gilfix was here\xe1\x88\xb4\r\n'
Traceback (most recent call last): File "/home/dje/cpython-buildarea/3.x.edelsohn-fedora-rawhide-z/build/Lib/test/test_socket.py", line 365, in raise_queued_exception raise self.queue.get() File "/home/dje/cpython-buildarea/3.x.edelsohn-fedora-rawhide-z/build/Lib/test/test_socket.py", line 402, in clientRun test_func() File "/home/dje/cpython-buildarea/3.x.edelsohn-fedora-rawhide-z/build/Lib/test/test_socket.py", line 3672, in _testFDPassCMSG_SPACE self.createAndSendFDs(4) File "/home/dje/cpython-buildarea/3.x.edelsohn-fedora-rawhide-z/build/Lib/test/test_socket.py", line 3611, in createAndSendFDs array.array("i", self.newFDs(n)))]), ^^^^^^^^^^^^^^ File "/home/dje/cpython-buildarea/3.x.edelsohn-fedora-rawhide-z/build/Lib/test/test_socket.py", line 3578, in newFDs os.write(fd, str(i).encode()) OSError: [Errno 28] No space left on device
Traceback (most recent call last): File "/home/dje/cpython-buildarea/3.x.edelsohn-fedora-rawhide-z/build/Lib/test/test_socket.py", line 3916, in testCmsgTruncLen2Minus1 self.checkTruncatedArray(ancbuf=socket.CMSG_LEN(2 * SIZEOF_INT) - 1, File "/home/dje/cpython-buildarea/3.x.edelsohn-fedora-rawhide-z/build/Lib/test/test_socket.py", line 3879, in checkTruncatedArray self.assertEqual(msg, MSG) AssertionError: b'' != b'Michael Gilfix was here\xe1\x88\xb4\r\n'
Traceback (most recent call last): File "/home/dje/cpython-buildarea/3.x.edelsohn-fedora-rawhide-z/build/Lib/test/test_socket.py", line 365, in raise_queued_exception raise self.queue.get() File "/home/dje/cpython-buildarea/3.x.edelsohn-fedora-rawhide-z/build/Lib/test/test_socket.py", line 402, in clientRun test_func() File "/home/dje/cpython-buildarea/3.x.edelsohn-fedora-rawhide-z/build/Lib/test/test_socket.py", line 3860, in _testCmsgTrunc2Int self.createAndSendFDs(1) File "/home/dje/cpython-buildarea/3.x.edelsohn-fedora-rawhide-z/build/Lib/test/test_socket.py", line 3611, in createAndSendFDs array.array("i", self.newFDs(n)))]), ^^^^^^^^^^^^^^ File "/home/dje/cpython-buildarea/3.x.edelsohn-fedora-rawhide-z/build/Lib/test/test_socket.py", line 3578, in newFDs os.write(fd, str(i).encode()) OSError: [Errno 28] No space left on device
Traceback (most recent call last): File "/home/dje/cpython-buildarea/3.x.edelsohn-fedora-rawhide-z/build/Lib/runpy.py", line 198, in _run_module_as_main return _run_code(code, main_globals, None, ^^^^^^^^^^^^^^^^^^^^^^^^^^^^^^^^^^^ File "/home/dje/cpython-buildarea/3.x.edelsohn-fedora-rawhide-z/build/Lib/runpy.py", line 88, in _run_code exec(code, run_globals) File "/home/dje/cpython-buildarea/3.x.edelsohn-fedora-rawhide-z/build/Lib/ensurepip/__main__.py", line 5, in <module> sys.exit(ensurepip._main()) ^^^^^^^^^^^^^^^^^ File "/home/dje/cpython-buildarea/3.x.edelsohn-fedora-rawhide-z/build/Lib/ensurepip/__init__.py", line 284, in _main return _bootstrap( ^^^^^^^^^^^ File "/home/dje/cpython-buildarea/3.x.edelsohn-fedora-rawhide-z/build/Lib/ensurepip/__init__.py", line 200, in _bootstrap return _run_pip([*args, *_PACKAGE_NAMES], additional_paths) ^^^^^^^^^^^^^^^^^^^^^^^^^^^^^^^^^^^^^^^^^^^^^^^^^^^^ File "/home/dje/cpython-buildarea/3.x.edelsohn-fedora-rawhide-z/build/Lib/ensurepip/__init__.py", line 101, in _run_pip return subprocess.run(cmd, check=True).returncode ^^^^^^^^^^^^^^^^^^^^^^^^^^^^^^^ File "/home/dje/cpython-buildarea/3.x.edelsohn-fedora-rawhide-z/build/Lib/subprocess.py", line 571, in run raise CalledProcessError(retcode, process.args, subprocess.CalledProcessError: Command '['/tmp/test_python_h4a2_lpt/tmpmzhunqnk/bin/python', '-W', 'ignore::DeprecationWarning', '-c', '\nimport runpy\nimport sys\nsys.path = [\'/tmp/test_python_h4a2_lpt/tmpxj78p3_b/pip-23.2.1-py3-none-any.whl\'] + sys.path\nsys.argv[1:] = [\'install\', \'--no-cache-dir\', \'--no-index\', \'--find-links\', \'/tmp/test_python_h4a2_lpt/tmpxj78p3_b\', \'--upgrade\', \'pip\']\nrunpy.run_module("pip", run_name="__main__", alter_sys=True)\n']' returned non-zero exit status 1.
Traceback (most recent call last): File "/home/dje/cpython-buildarea/3.x.edelsohn-fedora-rawhide-z/build/Lib/test/test_socket.py", line 3666, in testFDPassCMSG_SPACE self.checkRecvmsgFDs( File "/home/dje/cpython-buildarea/3.x.edelsohn-fedora-rawhide-z/build/Lib/test/test_socket.py", line 3621, in checkRecvmsgFDs self.assertEqual(msg, MSG) AssertionError: b'' != b'Michael Gilfix was here\xe1\x88\xb4\r\n'
Traceback (most recent call last): File "/home/dje/cpython-buildarea/3.x.edelsohn-fedora-rawhide-z/build/Lib/test/test_socket.py", line 3787, in testFDPassPartialIntInMiddle self.assertEqual(msg, MSG) AssertionError: b'' != b'Michael Gilfix was here\xe1\x88\xb4\r\n'
Traceback (most recent call last): File "/home/dje/cpython-buildarea/3.x.edelsohn-fedora-rawhide-z/build/Lib/test/test_socket.py", line 365, in raise_queued_exception raise self.queue.get() File "/home/dje/cpython-buildarea/3.x.edelsohn-fedora-rawhide-z/build/Lib/test/test_socket.py", line 402, in clientRun test_func() File "/home/dje/cpython-buildarea/3.x.edelsohn-fedora-rawhide-z/build/Lib/test/test_socket.py", line 3833, in _testCmsgTruncNoBufSize self.createAndSendFDs(1) File "/home/dje/cpython-buildarea/3.x.edelsohn-fedora-rawhide-z/build/Lib/test/test_socket.py", line 3611, in createAndSendFDs array.array("i", self.newFDs(n)))]), ^^^^^^^^^^^^^^ File "/home/dje/cpython-buildarea/3.x.edelsohn-fedora-rawhide-z/build/Lib/test/test_socket.py", line 3578, in newFDs os.write(fd, str(i).encode()) OSError: [Errno 28] No space left on device
Traceback (most recent call last): File "/home/dje/cpython-buildarea/3.x.edelsohn-fedora-rawhide-z/build/Lib/test/test_socket.py", line 365, in raise_queued_exception raise self.queue.get() File "/home/dje/cpython-buildarea/3.x.edelsohn-fedora-rawhide-z/build/Lib/test/test_socket.py", line 402, in clientRun test_func() File "/home/dje/cpython-buildarea/3.x.edelsohn-fedora-rawhide-z/build/Lib/test/test_socket.py", line 3913, in _testCmsgTruncLen1 self.createAndSendFDs(2) File "/home/dje/cpython-buildarea/3.x.edelsohn-fedora-rawhide-z/build/Lib/test/test_socket.py", line 3611, in createAndSendFDs array.array("i", self.newFDs(n)))]), ^^^^^^^^^^^^^^ File "/home/dje/cpython-buildarea/3.x.edelsohn-fedora-rawhide-z/build/Lib/test/test_socket.py", line 3578, in newFDs os.write(fd, str(i).encode()) OSError: [Errno 28] No space left on device
Traceback (most recent call last): File "/home/dje/cpython-buildarea/3.x.edelsohn-fedora-rawhide-z/build/Lib/test/test_socket.py", line 3856, in testCmsgTrunc2Int self.checkTruncatedHeader(self.doRecvmsg(self.serv_sock, len(MSG), File "/home/dje/cpython-buildarea/3.x.edelsohn-fedora-rawhide-z/build/Lib/test/test_socket.py", line 3817, in checkTruncatedHeader self.assertEqual(msg, MSG) AssertionError: b'' != b'Michael Gilfix was here\xe1\x88\xb4\r\n'
Traceback (most recent call last): File "/home/dje/cpython-buildarea/3.x.edelsohn-fedora-rawhide-z/build/Lib/test/test_socket.py", line 3718, in testFDPassSeparateMinSpace self.checkRecvmsgFDs(num_fds, File "/home/dje/cpython-buildarea/3.x.edelsohn-fedora-rawhide-z/build/Lib/test/test_socket.py", line 3621, in checkRecvmsgFDs self.assertEqual(msg, MSG) AssertionError: b'' != b'Michael Gilfix was here\xe1\x88\xb4\r\n'
Traceback (most recent call last): File "/home/dje/cpython-buildarea/3.x.edelsohn-fedora-rawhide-z/build/Lib/test/test_socket.py", line 3847, in testCmsgTrunc1 self.checkTruncatedHeader(self.doRecvmsg(self.serv_sock, len(MSG), 1)) File "/home/dje/cpython-buildarea/3.x.edelsohn-fedora-rawhide-z/build/Lib/test/test_socket.py", line 3817, in checkTruncatedHeader self.assertEqual(msg, MSG) AssertionError: b'' != b'Michael Gilfix was here\xe1\x88\xb4\r\n'
Traceback (most recent call last): File "/home/dje/cpython-buildarea/3.x.edelsohn-fedora-rawhide-z/build/Lib/test/test_socket.py", line 365, in raise_queued_exception raise self.queue.get() File "/home/dje/cpython-buildarea/3.x.edelsohn-fedora-rawhide-z/build/Lib/test/test_socket.py", line 402, in clientRun test_func() File "/home/dje/cpython-buildarea/3.x.edelsohn-fedora-rawhide-z/build/Lib/test/test_socket.py", line 3728, in _testFDPassSeparateMinSpace fd0, fd1 = self.newFDs(2) ^^^^^^^^^^^^^^ File "/home/dje/cpython-buildarea/3.x.edelsohn-fedora-rawhide-z/build/Lib/test/test_socket.py", line 3578, in newFDs os.write(fd, str(i).encode()) OSError: [Errno 28] No space left on device
Traceback (most recent call last): File "/home/dje/cpython-buildarea/3.x.edelsohn-fedora-rawhide-z/build/Lib/test/test_socket.py", line 3657, in testMultipleFDPass self.checkRecvmsgFDs(4, self.doRecvmsg(self.serv_sock, File "/home/dje/cpython-buildarea/3.x.edelsohn-fedora-rawhide-z/build/Lib/test/test_socket.py", line 3621, in checkRecvmsgFDs self.assertEqual(msg, MSG) AssertionError: b'' != b'Michael Gilfix was here\xe1\x88\xb4\r\n'
Traceback (most recent call last): File "/home/dje/cpython-buildarea/3.x.edelsohn-fedora-rawhide-z/build/Lib/test/test_socket.py", line 365, in raise_queued_exception raise self.queue.get() File "/home/dje/cpython-buildarea/3.x.edelsohn-fedora-rawhide-z/build/Lib/test/test_socket.py", line 402, in clientRun test_func() File "/home/dje/cpython-buildarea/3.x.edelsohn-fedora-rawhide-z/build/Lib/test/test_socket.py", line 3850, in _testCmsgTrunc1 self.createAndSendFDs(1) File "/home/dje/cpython-buildarea/3.x.edelsohn-fedora-rawhide-z/build/Lib/test/test_socket.py", line 3611, in createAndSendFDs array.array("i", self.newFDs(n)))]), ^^^^^^^^^^^^^^ File "/home/dje/cpython-buildarea/3.x.edelsohn-fedora-rawhide-z/build/Lib/test/test_socket.py", line 3578, in newFDs os.write(fd, str(i).encode()) OSError: [Errno 28] No space left on device
Traceback (most recent call last): File "/home/dje/cpython-buildarea/3.x.edelsohn-fedora-rawhide-z/build/Lib/test/test_socket.py", line 365, in raise_queued_exception raise self.queue.get() File "/home/dje/cpython-buildarea/3.x.edelsohn-fedora-rawhide-z/build/Lib/test/test_socket.py", line 402, in clientRun test_func() File "/home/dje/cpython-buildarea/3.x.edelsohn-fedora-rawhide-z/build/Lib/test/test_socket.py", line 3685, in _testFDPassCMSG_LEN self.createAndSendFDs(1) File "/home/dje/cpython-buildarea/3.x.edelsohn-fedora-rawhide-z/build/Lib/test/test_socket.py", line 3611, in createAndSendFDs array.array("i", self.newFDs(n)))]), ^^^^^^^^^^^^^^ File "/home/dje/cpython-buildarea/3.x.edelsohn-fedora-rawhide-z/build/Lib/test/test_socket.py", line 3578, in newFDs os.write(fd, str(i).encode()) OSError: [Errno 28] No space left on device
Traceback (most recent call last): File "/home/dje/cpython-buildarea/3.x.edelsohn-fedora-rawhide-z/build/Lib/test/test_socket.py", line 3693, in testFDPassSeparate self.checkRecvmsgFDs(2, File "/home/dje/cpython-buildarea/3.x.edelsohn-fedora-rawhide-z/build/Lib/test/test_socket.py", line 3621, in checkRecvmsgFDs self.assertEqual(msg, MSG) AssertionError: b'' != b'Michael Gilfix was here\xe1\x88\xb4\r\n'
Traceback (most recent call last): File "/home/dje/cpython-buildarea/3.x.edelsohn-fedora-rawhide-z/build/Lib/test/test_socket.py", line 365, in raise_queued_exception raise self.queue.get() File "/home/dje/cpython-buildarea/3.x.edelsohn-fedora-rawhide-z/build/Lib/test/test_socket.py", line 402, in clientRun test_func() File "/home/dje/cpython-buildarea/3.x.edelsohn-fedora-rawhide-z/build/Lib/test/test_socket.py", line 3920, in _testCmsgTruncLen2Minus1 self.createAndSendFDs(2) File "/home/dje/cpython-buildarea/3.x.edelsohn-fedora-rawhide-z/build/Lib/test/test_socket.py", line 3611, in createAndSendFDs array.array("i", self.newFDs(n)))]), ^^^^^^^^^^^^^^ File "/home/dje/cpython-buildarea/3.x.edelsohn-fedora-rawhide-z/build/Lib/test/test_socket.py", line 3578, in newFDs os.write(fd, str(i).encode()) OSError: [Errno 28] No space left on device
Traceback (most recent call last): File "/home/dje/cpython-buildarea/3.x.edelsohn-fedora-rawhide-z/build/Lib/test/test_socket.py", line 365, in raise_queued_exception raise self.queue.get() File "/home/dje/cpython-buildarea/3.x.edelsohn-fedora-rawhide-z/build/Lib/test/test_socket.py", line 402, in clientRun test_func() File "/home/dje/cpython-buildarea/3.x.edelsohn-fedora-rawhide-z/build/Lib/test/test_socket.py", line 3701, in _testFDPassSeparate fd0, fd1 = self.newFDs(2) ^^^^^^^^^^^^^^ File "/home/dje/cpython-buildarea/3.x.edelsohn-fedora-rawhide-z/build/Lib/test/test_socket.py", line 3578, in newFDs os.write(fd, str(i).encode()) OSError: [Errno 28] No space left on device
Traceback (most recent call last): File "/home/dje/cpython-buildarea/3.x.edelsohn-fedora-rawhide-z/build/Lib/test/test_socket.py", line 3643, in testFDPassSimple self.checkRecvmsgFDs(1, self.doRecvmsg(self.serv_sock, File "/home/dje/cpython-buildarea/3.x.edelsohn-fedora-rawhide-z/build/Lib/test/test_socket.py", line 3621, in checkRecvmsgFDs self.assertEqual(msg, MSG) AssertionError: b'' != b'Michael Gilfix was here\xe1\x88\xb4\r\n'
Traceback (most recent call last): File "/home/dje/cpython-buildarea/3.x.edelsohn-fedora-rawhide-z/build/Lib/test/test_socket.py", line 365, in raise_queued_exception raise self.queue.get() File "/home/dje/cpython-buildarea/3.x.edelsohn-fedora-rawhide-z/build/Lib/test/test_socket.py", line 402, in clientRun test_func() File "/home/dje/cpython-buildarea/3.x.edelsohn-fedora-rawhide-z/build/Lib/test/test_socket.py", line 3841, in _testCmsgTrunc0 self.createAndSendFDs(1) File "/home/dje/cpython-buildarea/3.x.edelsohn-fedora-rawhide-z/build/Lib/test/test_socket.py", line 3611, in createAndSendFDs array.array("i", self.newFDs(n)))]), ^^^^^^^^^^^^^^ File "/home/dje/cpython-buildarea/3.x.edelsohn-fedora-rawhide-z/build/Lib/test/test_socket.py", line 3578, in newFDs os.write(fd, str(i).encode()) OSError: [Errno 28] No space left on device
Traceback (most recent call last): File "/home/dje/cpython-buildarea/3.x.edelsohn-fedora-rawhide-z/build/Lib/test/test_socket.py", line 365, in raise_queued_exception raise self.queue.get() File "/home/dje/cpython-buildarea/3.x.edelsohn-fedora-rawhide-z/build/Lib/test/test_socket.py", line 402, in clientRun test_func() File "/home/dje/cpython-buildarea/3.x.edelsohn-fedora-rawhide-z/build/Lib/test/test_socket.py", line 3906, in _testCmsgTruncLen0Plus1 self.createAndSendFDs(2) File "/home/dje/cpython-buildarea/3.x.edelsohn-fedora-rawhide-z/build/Lib/test/test_socket.py", line 3611, in createAndSendFDs array.array("i", self.newFDs(n)))]), ^^^^^^^^^^^^^^ File "/home/dje/cpython-buildarea/3.x.edelsohn-fedora-rawhide-z/build/Lib/test/test_socket.py", line 3578, in newFDs os.write(fd, str(i).encode()) OSError: [Errno 28] No space left on device
Traceback (most recent call last): File "/home/dje/cpython-buildarea/3.x.edelsohn-fedora-rawhide-z/build/Lib/test/test_socket.py", line 365, in raise_queued_exception raise self.queue.get() File "/home/dje/cpython-buildarea/3.x.edelsohn-fedora-rawhide-z/build/Lib/test/test_socket.py", line 402, in clientRun test_func() File "/home/dje/cpython-buildarea/3.x.edelsohn-fedora-rawhide-z/build/Lib/test/test_socket.py", line 3867, in _testCmsgTruncLen0Minus1 self.createAndSendFDs(1) File "/home/dje/cpython-buildarea/3.x.edelsohn-fedora-rawhide-z/build/Lib/test/test_socket.py", line 3611, in createAndSendFDs array.array("i", self.newFDs(n)))]), ^^^^^^^^^^^^^^ File "/home/dje/cpython-buildarea/3.x.edelsohn-fedora-rawhide-z/build/Lib/test/test_socket.py", line 3578, in newFDs os.write(fd, str(i).encode()) OSError: [Errno 28] No space left on device
Traceback (most recent call last): File "/home/dje/cpython-buildarea/3.x.edelsohn-fedora-rawhide-z/build/Lib/test/test_socket.py", line 365, in raise_queued_exception raise self.queue.get() File "/home/dje/cpython-buildarea/3.x.edelsohn-fedora-rawhide-z/build/Lib/test/test_socket.py", line 402, in clientRun test_func() File "/home/dje/cpython-buildarea/3.x.edelsohn-fedora-rawhide-z/build/Lib/test/test_socket.py", line 3900, in _testCmsgTruncLen0 self.createAndSendFDs(1) File "/home/dje/cpython-buildarea/3.x.edelsohn-fedora-rawhide-z/build/Lib/test/test_socket.py", line 3611, in createAndSendFDs array.array("i", self.newFDs(n)))]), ^^^^^^^^^^^^^^ File "/home/dje/cpython-buildarea/3.x.edelsohn-fedora-rawhide-z/build/Lib/test/test_socket.py", line 3578, in newFDs os.write(fd, str(i).encode()) OSError: [Errno 28] No space left on device
Traceback (most recent call last): File "/home/dje/cpython-buildarea/3.x.edelsohn-fedora-rawhide-z/build/Lib/test/test_socket.py", line 3676, in testFDPassCMSG_LEN self.checkRecvmsgFDs(1, File "/home/dje/cpython-buildarea/3.x.edelsohn-fedora-rawhide-z/build/Lib/test/test_socket.py", line 3621, in checkRecvmsgFDs self.assertEqual(msg, MSG) AssertionError: b'' != b'Michael Gilfix was here\xe1\x88\xb4\r\n'
Traceback (most recent call last): File "/home/dje/cpython-buildarea/3.x.edelsohn-fedora-rawhide-z/build/Lib/test/test_tools/test_freeze.py", line 27, in test_freeze_simple_script outdir, scriptfile, python = helper.prepare(script, outdir) ^^^^^^^^^^^^^^^^^^^^^^^^^^^^^^ File "/home/dje/cpython-buildarea/3.x.edelsohn-fedora-rawhide-z/build/Tools/freeze/test/freeze.py", line 184, in prepare _run_quiet([MAKE, '-C', builddir, 'install']) File "/home/dje/cpython-buildarea/3.x.edelsohn-fedora-rawhide-z/build/Tools/freeze/test/freeze.py", line 25, in _run_quiet return subprocess.run( ^^^^^^^^^^^^^^^ File "/home/dje/cpython-buildarea/3.x.edelsohn-fedora-rawhide-z/build/Lib/subprocess.py", line 571, in run raise CalledProcessError(retcode, process.args, subprocess.CalledProcessError: Command '['/usr/bin/make', '-C', '/tmp/test_python_rwdxd7bn/tmp566gued3/python-build', 'install']' returned non-zero exit status 2.
Traceback (most recent call last): File "/home/dje/cpython-buildarea/3.x.edelsohn-fedora-rawhide-z/build/Lib/test/test_socket.py", line 3837, in testCmsgTrunc0 self.checkTruncatedHeader(self.doRecvmsg(self.serv_sock, len(MSG), 0), File "/home/dje/cpython-buildarea/3.x.edelsohn-fedora-rawhide-z/build/Lib/test/test_socket.py", line 3817, in checkTruncatedHeader self.assertEqual(msg, MSG) AssertionError: b'' != b'Michael Gilfix was here\xe1\x88\xb4\r\n'
Traceback (most recent call last): File "/home/dje/cpython-buildarea/3.x.edelsohn-fedora-rawhide-z/build/Lib/test/test_socket.py", line 3826, in testCmsgTruncNoBufSize self.checkTruncatedHeader(self.doRecvmsg(self.serv_sock, len(MSG)), File "/home/dje/cpython-buildarea/3.x.edelsohn-fedora-rawhide-z/build/Lib/test/test_socket.py", line 3817, in checkTruncatedHeader self.assertEqual(msg, MSG) AssertionError: b'' != b'Michael Gilfix was here\xe1\x88\xb4\r\n'
Traceback (most recent call last): File "/home/dje/cpython-buildarea/3.x.edelsohn-fedora-rawhide-z/build/Lib/test/test_socket.py", line 365, in raise_queued_exception raise self.queue.get() File "/home/dje/cpython-buildarea/3.x.edelsohn-fedora-rawhide-z/build/Lib/test/test_socket.py", line 402, in clientRun test_func() File "/home/dje/cpython-buildarea/3.x.edelsohn-fedora-rawhide-z/build/Lib/test/test_socket.py", line 3803, in _testFDPassPartialIntInMiddle fd0, fd1 = self.newFDs(2) ^^^^^^^^^^^^^^ File "/home/dje/cpython-buildarea/3.x.edelsohn-fedora-rawhide-z/build/Lib/test/test_socket.py", line 3578, in newFDs os.write(fd, str(i).encode()) OSError: [Errno 28] No space left on device
Traceback (most recent call last): File "/home/dje/cpython-buildarea/3.x.edelsohn-fedora-rawhide-z/build/Lib/test/test_socket.py", line 365, in raise_queued_exception raise self.queue.get() File "/home/dje/cpython-buildarea/3.x.edelsohn-fedora-rawhide-z/build/Lib/test/test_socket.py", line 402, in clientRun test_func() File "/home/dje/cpython-buildarea/3.x.edelsohn-fedora-rawhide-z/build/Lib/test/test_socket.py", line 3661, in _testMultipleFDPass self.createAndSendFDs(4) File "/home/dje/cpython-buildarea/3.x.edelsohn-fedora-rawhide-z/build/Lib/test/test_socket.py", line 3611, in createAndSendFDs array.array("i", self.newFDs(n)))]), ^^^^^^^^^^^^^^ File "/home/dje/cpython-buildarea/3.x.edelsohn-fedora-rawhide-z/build/Lib/test/test_socket.py", line 3578, in newFDs os.write(fd, str(i).encode()) OSError: [Errno 28] No space left on device
Traceback (most recent call last): File "/home/dje/cpython-buildarea/3.x.edelsohn-fedora-rawhide-z/build/Lib/test/test_tools/test_freeze.py", line 27, in test_freeze_simple_script outdir, scriptfile, python = helper.prepare(script, outdir) ^^^^^^^^^^^^^^^^^^^^^^^^^^^^^^ File "/home/dje/cpython-buildarea/3.x.edelsohn-fedora-rawhide-z/build/Tools/freeze/test/freeze.py", line 184, in prepare _run_quiet([MAKE, '-C', builddir, 'install']) File "/home/dje/cpython-buildarea/3.x.edelsohn-fedora-rawhide-z/build/Tools/freeze/test/freeze.py", line 25, in _run_quiet return subprocess.run( ^^^^^^^^^^^^^^^ File "/home/dje/cpython-buildarea/3.x.edelsohn-fedora-rawhide-z/build/Lib/subprocess.py", line 571, in run raise CalledProcessError(retcode, process.args, subprocess.CalledProcessError: Command '['/usr/bin/make', '-C', '/tmp/tmpjgcdrq16/python-build', 'install']' returned non-zero exit status 2.
Traceback (most recent call last): File "/home/dje/cpython-buildarea/3.x.edelsohn-fedora-rawhide-z/build/Lib/test/test_socket.py", line 3909, in testCmsgTruncLen1 self.checkTruncatedArray(ancbuf=socket.CMSG_LEN(SIZEOF_INT), File "/home/dje/cpython-buildarea/3.x.edelsohn-fedora-rawhide-z/build/Lib/test/test_socket.py", line 3879, in checkTruncatedArray self.assertEqual(msg, MSG) AssertionError: b'' != b'Michael Gilfix was here\xe1\x88\xb4\r\n'
Traceback (most recent call last): File "/home/dje/cpython-buildarea/3.x.edelsohn-fedora-rawhide-z/build/Lib/test/test_venv.py", line 781, in test_with_pip self.do_test_with_pip(False) File "/home/dje/cpython-buildarea/3.x.edelsohn-fedora-rawhide-z/build/Lib/test/test_venv.py", line 704, in do_test_with_pip with self.nicer_error(): File "/home/dje/cpython-buildarea/3.x.edelsohn-fedora-rawhide-z/build/Lib/contextlib.py", line 159, in __exit__ self.gen.throw(value) File "/home/dje/cpython-buildarea/3.x.edelsohn-fedora-rawhide-z/build/Lib/test/test_venv.py", line 773, in nicer_error self.fail( AssertionError: Command '['/tmp/test_python_h4a2_lpt/tmpmzhunqnk/bin/python', '-m', 'ensurepip', '--upgrade', '--default-pip']' returned non-zero exit status 1.
Traceback (most recent call last): File "/home/dje/cpython-buildarea/3.x.edelsohn-fedora-rawhide-z/build/Lib/test/test_socket.py", line 365, in raise_queued_exception raise self.queue.get() File "/home/dje/cpython-buildarea/3.x.edelsohn-fedora-rawhide-z/build/Lib/test/test_socket.py", line 402, in clientRun test_func() File "/home/dje/cpython-buildarea/3.x.edelsohn-fedora-rawhide-z/build/Lib/test/test_socket.py", line 3652, in _testFDPassSimple array.array("i", self.newFDs(1)).tobytes())]), ^^^^^^^^^^^^^^ File "/home/dje/cpython-buildarea/3.x.edelsohn-fedora-rawhide-z/build/Lib/test/test_socket.py", line 3578, in newFDs os.write(fd, str(i).encode()) OSError: [Errno 28] No space left on device
Test report
Failed tests:
- test_tools
Failed subtests:
- testCmsgTruncNoBufSize - test.test_socket.RecvmsgIntoSCMRightsStreamTest.testCmsgTruncNoBufSize
- testCmsgTruncLen0Minus1 - test.test_socket.RecvmsgIntoSCMRightsStreamTest.testCmsgTruncLen0Minus1
- testCmsgTruncLen0 - test.test_socket.RecvmsgIntoSCMRightsStreamTest.testCmsgTruncLen0
- test_freeze_simple_script - test.test_tools.test_freeze.TestFreeze.test_freeze_simple_script
- testFDPassCMSG_SPACE - test.test_socket.RecvmsgIntoSCMRightsStreamTest.testFDPassCMSG_SPACE
- testFDPassSeparate - test.test_socket.RecvmsgIntoSCMRightsStreamTest.testFDPassSeparate
- testFDPassSimple - test.test_socket.RecvmsgIntoSCMRightsStreamTest.testFDPassSimple
- testCmsgTrunc2Int - test.test_socket.RecvmsgIntoSCMRightsStreamTest.testCmsgTrunc2Int
- testCmsgTruncLen2Minus1 - test.test_socket.RecvmsgIntoSCMRightsStreamTest.testCmsgTruncLen2Minus1
- testFDPassSeparateMinSpace - test.test_socket.RecvmsgIntoSCMRightsStreamTest.testFDPassSeparateMinSpace
- test_with_pip - test.test_venv.EnsurePipTest.test_with_pip
- testMultipleFDPass - test.test_socket.RecvmsgIntoSCMRightsStreamTest.testMultipleFDPass
- testCmsgTrunc0 - test.test_socket.RecvmsgIntoSCMRightsStreamTest.testCmsgTrunc0
- testCmsgTruncLen1 - test.test_socket.RecvmsgIntoSCMRightsStreamTest.testCmsgTruncLen1
- testCmsgTruncLen0Plus1 - test.test_socket.RecvmsgIntoSCMRightsStreamTest.testCmsgTruncLen0Plus1
- testFDPassPartialIntInMiddle - test.test_socket.RecvmsgIntoSCMRightsStreamTest.testFDPassPartialIntInMiddle
- testFDPassCMSG_LEN - test.test_socket.RecvmsgIntoSCMRightsStreamTest.testFDPassCMSG_LEN
- testCmsgTrunc1 - test.test_socket.RecvmsgIntoSCMRightsStreamTest.testCmsgTrunc1
Sincerely, -The Buildbot
participants (1)
-
buildbot@python.org