☠ Buildbot (Python): python/cpython - failed compile (failure) (3.13)
The Buildbot has detected a new failure on builder wasm32-wasi 3.13 while building python/cpython. Full details are available at: https://buildbot.python.org/#/builders/1502/builds/2273
Buildbot URL: https://buildbot.python.org/
Worker for this Build: bcannon-wasi
Build Reason: <unknown> Blamelist: Miss Islington (bot) <31488909+miss-islington@users.noreply.github.com>
BUILD FAILED: failed compile (failure)
Summary of the results of the build (if available):
Captured traceback
Note: switching to '65d110d987c4cd43a36138d164327aec1d4cfa1d'.
You are in 'detached HEAD' state. You can look around, make experimental changes and commit them, and you can discard any commits you make in this state without impacting any branches by switching back to a branch.
If you want to create a new branch to retain commits you create, you may do so (now or later) by using -c with the switch command. Example:
git switch -c <new-branch-name>
Or undo this operation with:
git switch -
Turn off this advice by setting config variable advice.detachedHead to false
HEAD is now at 65d110d987c4c [3.13] gh-152415: Exercise curses non-ASCII tests under 8-bit locale encodings (GH-152416) (GH-152453) (GH-152457) Switched to and reset branch '3.13'
In file included from ../../Modules/_testexternalinspection.c:53: In file included from ../../Include/Python.h:14: ./pyconfig.h:1970:9: warning: '_POSIX_C_SOURCE' macro redefined [-Wmacro-redefined] 1970 | #define _POSIX_C_SOURCE 200809L | ^ /usr/include/features.h:319:10: note: previous definition is here 319 | # define _POSIX_C_SOURCE 202405L | ^ In file included from ../../Modules/_testexternalinspection.c:53: In file included from ../../Include/Python.h:14: ./pyconfig.h:1991:9: warning: '_XOPEN_SOURCE' macro redefined [-Wmacro-redefined] 1991 | #define _XOPEN_SOURCE 700 | ^ /usr/include/features.h:234:10: note: previous definition is here 234 | # define _XOPEN_SOURCE 800 | ^ 2 warnings generated.
configure: WARNING: using cross tools not prefixed with host triplet configure: WARNING: no system libmpdec found; falling back to bundled libmpdec (deprecated and scheduled for removal in Python 3.16)
In file included from ../../Modules/md5module.c:37:
In file included from ../../Modules/_hacl/Hacl_Hash_MD5.h:35:
In file included from ../../Modules/_hacl/include/krml/types.h:12:
../../Modules/_hacl/include/krml/lowstar_endianness.h:130:11: warning: 'htole32' macro redefined [-Wmacro-redefined]
130 | # define htole32(x) (x)
| ^
/opt/wasi-sdk-24.0-x86_64-linux/bin/../share/wasi-sysroot/include/wasm32-wasi/endian.h:43:9: note: previous definition is here
43 | #define htole32(x) (uint32_t)(x)
| ^
In file included from ../../Modules/md5module.c:37:
In file included from ../../Modules/_hacl/Hacl_Hash_MD5.h:35:
In file included from ../../Modules/_hacl/include/krml/types.h:12:
../../Modules/_hacl/include/krml/lowstar_endianness.h:131:11: warning: 'le32toh' macro redefined [-Wmacro-redefined]
131 | # define le32toh(x) (x)
| ^
/opt/wasi-sdk-24.0-x86_64-linux/bin/../share/wasi-sysroot/include/wasm32-wasi/endian.h:44:9: note: previous definition is here
44 | #define le32toh(x) (uint32_t)(x)
| ^
In file included from ../../Modules/md5module.c:37:
In file included from ../../Modules/_hacl/Hacl_Hash_MD5.h:35:
In file included from ../../Modules/_hacl/include/krml/types.h:12:
../../Modules/_hacl/include/krml/lowstar_endianness.h:132:11: warning: 'htobe32' macro redefined [-Wmacro-redefined]
132 | # define htobe32(x)
| ^
/opt/wasi-sdk-24.0-x86_64-linux/bin/../share/wasi-sysroot/include/wasm32-wasi/endian.h:37:9: note: previous definition is here
37 | #define htobe32(x) __bswap32(x)
| ^
In file included from ../../Modules/md5module.c:37:
In file included from ../../Modules/_hacl/Hacl_Hash_MD5.h:35:
In file included from ../../Modules/_hacl/include/krml/types.h:12:
../../Modules/_hacl/include/krml/lowstar_endianness.h:138:11: warning: 'be32toh' macro redefined [-Wmacro-redefined]
138 | # define be32toh(x) (htobe32((x)))
| ^
/opt/wasi-sdk-24.0-x86_64-linux/bin/../share/wasi-sysroot/include/wasm32-wasi/endian.h:38:9: note: previous definition is here
38 | #define be32toh(x) __bswap32(x)
| ^
In file included from ../../Modules/md5module.c:37:
In file included from ../../Modules/_hacl/Hacl_Hash_MD5.h:35:
In file included from ../../Modules/_hacl/include/krml/types.h:12:
../../Modules/_hacl/include/krml/lowstar_endianness.h:140:11: warning: 'htole64' macro redefined [-Wmacro-redefined]
140 | # define htole64(x) (x)
| ^
/opt/wasi-sdk-24.0-x86_64-linux/bin/../share/wasi-sysroot/include/wasm32-wasi/endian.h:45:9: note: previous definition is here
45 | #define htole64(x) (uint64_t)(x)
| ^
In file included from ../../Modules/md5module.c:37:
In file included from ../../Modules/_hacl/Hacl_Hash_MD5.h:35:
In file included from ../../Modules/_hacl/include/krml/types.h:12:
../../Modules/_hacl/include/krml/lowstar_endianness.h:141:11: warning: 'le64toh' macro redefined [-Wmacro-redefined]
141 | # define le64toh(x) (x)
| ^
/opt/wasi-sdk-24.0-x86_64-linux/bin/../share/wasi-sysroot/include/wasm32-wasi/endian.h:46:9: note: previous definition is here
46 | #define le64toh(x) (uint64_t)(x)
| ^
In file included from ../../Modules/md5module.c:37:
In file included from ../../Modules/_hacl/Hacl_Hash_MD5.h:35:
In file included from ../../Modules/_hacl/include/krml/types.h:12:
../../Modules/_hacl/include/krml/lowstar_endianness.h:142:11: warning: 'htobe64' macro redefined [-Wmacro-redefined]
142 | # define htobe64(x)
| ^
/opt/wasi-sdk-24.0-x86_64-linux/bin/../share/wasi-sysroot/include/wasm32-wasi/endian.h:39:9: note: previous definition is here
39 | #define htobe64(x) __bswap64(x)
| ^
In file included from ../../Modules/md5module.c:37:
In file included from ../../Modules/_hacl/Hacl_Hash_MD5.h:35:
In file included from ../../Modules/_hacl/include/krml/types.h:12:
../../Modules/_hacl/include/krml/lowstar_endianness.h:149:11: warning: 'be64toh' macro redefined [-Wmacro-redefined]
149 | # define be64toh(x) (htobe64((x)))
| ^
/opt/wasi-sdk-24.0-x86_64-linux/bin/../share/wasi-sysroot/include/wasm32-wasi/endian.h:40:9: note: previous definition is here
40 | #define be64toh(x) __bswap64(x)
| ^
8 warnings generated.
In file included from ../../Modules/sha1module.c:38:
In file included from ../../Modules/_hacl/Hacl_Hash_SHA1.h:35:
In file included from ../../Modules/_hacl/include/krml/types.h:12:
../../Modules/_hacl/include/krml/lowstar_endianness.h:130:11: warning: 'htole32' macro redefined [-Wmacro-redefined]
130 | # define htole32(x) (x)
| ^
/opt/wasi-sdk-24.0-x86_64-linux/bin/../share/wasi-sysroot/include/wasm32-wasi/endian.h:43:9: note: previous definition is here
43 | #define htole32(x) (uint32_t)(x)
| ^
In file included from ../../Modules/sha1module.c:38:
In file included from ../../Modules/_hacl/Hacl_Hash_SHA1.h:35:
In file included from ../../Modules/_hacl/include/krml/types.h:12:
../../Modules/_hacl/include/krml/lowstar_endianness.h:131:11: warning: 'le32toh' macro redefined [-Wmacro-redefined]
131 | # define le32toh(x) (x)
| ^
/opt/wasi-sdk-24.0-x86_64-linux/bin/../share/wasi-sysroot/include/wasm32-wasi/endian.h:44:9: note: previous definition is here
44 | #define le32toh(x) (uint32_t)(x)
| ^
In file included from ../../Modules/sha1module.c:38:
In file included from ../../Modules/_hacl/Hacl_Hash_SHA1.h:35:
In file included from ../../Modules/_hacl/include/krml/types.h:12:
../../Modules/_hacl/include/krml/lowstar_endianness.h:132:11: warning: 'htobe32' macro redefined [-Wmacro-redefined]
132 | # define htobe32(x)
| ^
/opt/wasi-sdk-24.0-x86_64-linux/bin/../share/wasi-sysroot/include/wasm32-wasi/endian.h:37:9: note: previous definition is here
37 | #define htobe32(x) __bswap32(x)
| ^
In file included from ../../Modules/sha1module.c:38:
In file included from ../../Modules/_hacl/Hacl_Hash_SHA1.h:35:
In file included from ../../Modules/_hacl/include/krml/types.h:12:
../../Modules/_hacl/include/krml/lowstar_endianness.h:138:11: warning: 'be32toh' macro redefined [-Wmacro-redefined]
138 | # define be32toh(x) (htobe32((x)))
| ^
/opt/wasi-sdk-24.0-x86_64-linux/bin/../share/wasi-sysroot/include/wasm32-wasi/endian.h:38:9: note: previous definition is here
38 | #define be32toh(x) __bswap32(x)
| ^
In file included from ../../Modules/sha1module.c:38:
In file included from ../../Modules/_hacl/Hacl_Hash_SHA1.h:35:
In file included from ../../Modules/_hacl/include/krml/types.h:12:
../../Modules/_hacl/include/krml/lowstar_endianness.h:140:11: warning: 'htole64' macro redefined [-Wmacro-redefined]
140 | # define htole64(x) (x)
| ^
/opt/wasi-sdk-24.0-x86_64-linux/bin/../share/wasi-sysroot/include/wasm32-wasi/endian.h:45:9: note: previous definition is here
45 | #define htole64(x) (uint64_t)(x)
| ^
In file included from ../../Modules/sha1module.c:38:
In file included from ../../Modules/_hacl/Hacl_Hash_SHA1.h:35:
In file included from ../../Modules/_hacl/include/krml/types.h:12:
../../Modules/_hacl/include/krml/lowstar_endianness.h:141:11: warning: 'le64toh' macro redefined [-Wmacro-redefined]
141 | # define le64toh(x) (x)
| ^
/opt/wasi-sdk-24.0-x86_64-linux/bin/../share/wasi-sysroot/include/wasm32-wasi/endian.h:46:9: note: previous definition is here
46 | #define le64toh(x) (uint64_t)(x)
| ^
In file included from ../../Modules/sha1module.c:38:
In file included from ../../Modules/_hacl/Hacl_Hash_SHA1.h:35:
In file included from ../../Modules/_hacl/include/krml/types.h:12:
../../Modules/_hacl/include/krml/lowstar_endianness.h:142:11: warning: 'htobe64' macro redefined [-Wmacro-redefined]
142 | # define htobe64(x)
| ^
/opt/wasi-sdk-24.0-x86_64-linux/bin/../share/wasi-sysroot/include/wasm32-wasi/endian.h:39:9: note: previous definition is here
39 | #define htobe64(x) __bswap64(x)
| ^
In file included from ../../Modules/sha1module.c:38:
In file included from ../../Modules/_hacl/Hacl_Hash_SHA1.h:35:
In file included from ../../Modules/_hacl/include/krml/types.h:12:
../../Modules/_hacl/include/krml/lowstar_endianness.h:149:11: warning: 'be64toh' macro redefined [-Wmacro-redefined]
149 | # define be64toh(x) (htobe64((x)))
| ^
/opt/wasi-sdk-24.0-x86_64-linux/bin/../share/wasi-sysroot/include/wasm32-wasi/endian.h:40:9: note: previous definition is here
40 | #define be64toh(x) __bswap64(x)
| ^
8 warnings generated.
In file included from ../../Modules/sha3module.c:59:
In file included from ../../Modules/_hacl/Hacl_Hash_SHA3.h:35:
In file included from ../../Modules/_hacl/include/krml/types.h:12:
../../Modules/_hacl/include/krml/lowstar_endianness.h:130:11: warning: 'htole32' macro redefined [-Wmacro-redefined]
130 | # define htole32(x) (x)
| ^
/opt/wasi-sdk-24.0-x86_64-linux/bin/../share/wasi-sysroot/include/wasm32-wasi/endian.h:43:9: note: previous definition is here
43 | #define htole32(x) (uint32_t)(x)
| ^
In file included from ../../Modules/sha3module.c:59:
In file included from ../../Modules/_hacl/Hacl_Hash_SHA3.h:35:
In file included from ../../Modules/_hacl/include/krml/types.h:12:
../../Modules/_hacl/include/krml/lowstar_endianness.h:131:11: warning: 'le32toh' macro redefined [-Wmacro-redefined]
131 | # define le32toh(x) (x)
| ^
/opt/wasi-sdk-24.0-x86_64-linux/bin/../share/wasi-sysroot/include/wasm32-wasi/endian.h:44:9: note: previous definition is here
44 | #define le32toh(x) (uint32_t)(x)
| ^
In file included from ../../Modules/sha3module.c:59:
In file included from ../../Modules/_hacl/Hacl_Hash_SHA3.h:35:
In file included from ../../Modules/_hacl/include/krml/types.h:12:
../../Modules/_hacl/include/krml/lowstar_endianness.h:132:11: warning: 'htobe32' macro redefined [-Wmacro-redefined]
132 | # define htobe32(x)
| ^
/opt/wasi-sdk-24.0-x86_64-linux/bin/../share/wasi-sysroot/include/wasm32-wasi/endian.h:37:9: note: previous definition is here
37 | #define htobe32(x) __bswap32(x)
| ^
In file included from ../../Modules/sha3module.c:59:
In file included from ../../Modules/_hacl/Hacl_Hash_SHA3.h:35:
In file included from ../../Modules/_hacl/include/krml/types.h:12:
../../Modules/_hacl/include/krml/lowstar_endianness.h:138:11: warning: 'be32toh' macro redefined [-Wmacro-redefined]
138 | # define be32toh(x) (htobe32((x)))
| ^
/opt/wasi-sdk-24.0-x86_64-linux/bin/../share/wasi-sysroot/include/wasm32-wasi/endian.h:38:9: note: previous definition is here
38 | #define be32toh(x) __bswap32(x)
| ^
In file included from ../../Modules/sha3module.c:59:
In file included from ../../Modules/_hacl/Hacl_Hash_SHA3.h:35:
In file included from ../../Modules/_hacl/include/krml/types.h:12:
../../Modules/_hacl/include/krml/lowstar_endianness.h:140:11: warning: 'htole64' macro redefined [-Wmacro-redefined]
140 | # define htole64(x) (x)
| ^
/opt/wasi-sdk-24.0-x86_64-linux/bin/../share/wasi-sysroot/include/wasm32-wasi/endian.h:45:9: note: previous definition is here
45 | #define htole64(x) (uint64_t)(x)
| ^
In file included from ../../Modules/sha3module.c:59:
In file included from ../../Modules/_hacl/Hacl_Hash_SHA3.h:35:
In file included from ../../Modules/_hacl/include/krml/types.h:12:
../../Modules/_hacl/include/krml/lowstar_endianness.h:141:11: warning: 'le64toh' macro redefined [-Wmacro-redefined]
141 | # define le64toh(x) (x)
| ^
/opt/wasi-sdk-24.0-x86_64-linux/bin/../share/wasi-sysroot/include/wasm32-wasi/endian.h:46:9: note: previous definition is here
46 | #define le64toh(x) (uint64_t)(x)
| ^
In file included from ../../Modules/sha3module.c:59:
In file included from ../../Modules/_hacl/Hacl_Hash_SHA3.h:35:
In file included from ../../Modules/_hacl/include/krml/types.h:12:
../../Modules/_hacl/include/krml/lowstar_endianness.h:142:11: warning: 'htobe64' macro redefined [-Wmacro-redefined]
142 | # define htobe64(x)
| ^
/opt/wasi-sdk-24.0-x86_64-linux/bin/../share/wasi-sysroot/include/wasm32-wasi/endian.h:39:9: note: previous definition is here
39 | #define htobe64(x) __bswap64(x)
| ^
In file included from ../../Modules/sha3module.c:59:
In file included from ../../Modules/_hacl/Hacl_Hash_SHA3.h:35:
In file included from ../../Modules/_hacl/include/krml/types.h:12:
../../Modules/_hacl/include/krml/lowstar_endianness.h:149:11: warning: 'be64toh' macro redefined [-Wmacro-redefined]
149 | # define be64toh(x) (htobe64((x)))
| ^
/opt/wasi-sdk-24.0-x86_64-linux/bin/../share/wasi-sysroot/include/wasm32-wasi/endian.h:40:9: note: previous definition is here
40 | #define be64toh(x) __bswap64(x)
| ^
8 warnings generated.
../../Modules/_testcapimodule.c:3342:13: warning: unused function 'finalize_thread_hang_cleanup_callback' [-Wunused-function]
3342 | static void finalize_thread_hang_cleanup_callback(void *Py_UNUSED(arg)) {
| ^~~~~~~~~~~~~~~~~~~~~~~~~~~~~~~~~~~~~
1 warning generated.
../../Modules/_sre/sre.c:2347:14: warning: comparison of integers of different signs: 'Py_ssize_t' (aka 'long') and 'Py_UCS4' (aka 'unsigned int') [-Wsign-compare]
2347 | assert(i <= SRE_MAXGROUPS);
| ~~~~~~~~~^~~~~~~~~~~~~~~~~
/opt/wasi-sdk-24.0-x86_64-linux/bin/../share/wasi-sysroot/include/wasm32-wasi/assert.h:8:28: note: expanded from macro 'assert'
8 | #define assert(x) ((void)((x) || (__assert_fail(#x, __FILE__, __LINE__, __func__),0)))
| ^
1 warning generated.
In file included from ../../Modules/sha2module.c:48:
In file included from ../../Modules/_hacl/Hacl_Hash_SHA2.h:35:
In file included from ../../Modules/_hacl/include/krml/types.h:12:
../../Modules/_hacl/include/krml/lowstar_endianness.h:130:11: warning: 'htole32' macro redefined [-Wmacro-redefined]
130 | # define htole32(x) (x)
| ^
/opt/wasi-sdk-24.0-x86_64-linux/bin/../share/wasi-sysroot/include/wasm32-wasi/endian.h:43:9: note: previous definition is here
43 | #define htole32(x) (uint32_t)(x)
| ^
In file included from ../../Modules/sha2module.c:48:
In file included from ../../Modules/_hacl/Hacl_Hash_SHA2.h:35:
In file included from ../../Modules/_hacl/include/krml/types.h:12:
../../Modules/_hacl/include/krml/lowstar_endianness.h:131:11: warning: 'le32toh' macro redefined [-Wmacro-redefined]
131 | # define le32toh(x) (x)
| ^
/opt/wasi-sdk-24.0-x86_64-linux/bin/../share/wasi-sysroot/include/wasm32-wasi/endian.h:44:9: note: previous definition is here
44 | #define le32toh(x) (uint32_t)(x)
| ^
In file included from ../../Modules/sha2module.c:48:
In file included from ../../Modules/_hacl/Hacl_Hash_SHA2.h:35:
In file included from ../../Modules/_hacl/include/krml/types.h:12:
../../Modules/_hacl/include/krml/lowstar_endianness.h:132:11: warning: 'htobe32' macro redefined [-Wmacro-redefined]
132 | # define htobe32(x)
| ^
/opt/wasi-sdk-24.0-x86_64-linux/bin/../share/wasi-sysroot/include/wasm32-wasi/endian.h:37:9: note: previous definition is here
37 | #define htobe32(x) __bswap32(x)
| ^
In file included from ../../Modules/sha2module.c:48:
In file included from ../../Modules/_hacl/Hacl_Hash_SHA2.h:35:
In file included from ../../Modules/_hacl/include/krml/types.h:12:
../../Modules/_hacl/include/krml/lowstar_endianness.h:138:11: warning: 'be32toh' macro redefined [-Wmacro-redefined]
138 | # define be32toh(x) (htobe32((x)))
| ^
/opt/wasi-sdk-24.0-x86_64-linux/bin/../share/wasi-sysroot/include/wasm32-wasi/endian.h:38:9: note: previous definition is here
38 | #define be32toh(x) __bswap32(x)
| ^
In file included from ../../Modules/sha2module.c:48:
In file included from ../../Modules/_hacl/Hacl_Hash_SHA2.h:35:
In file included from ../../Modules/_hacl/include/krml/types.h:12:
../../Modules/_hacl/include/krml/lowstar_endianness.h:140:11: warning: 'htole64' macro redefined [-Wmacro-redefined]
140 | # define htole64(x) (x)
| ^
/opt/wasi-sdk-24.0-x86_64-linux/bin/../share/wasi-sysroot/include/wasm32-wasi/endian.h:45:9: note: previous definition is here
45 | #define htole64(x) (uint64_t)(x)
| ^
In file included from ../../Modules/sha2module.c:48:
In file included from ../../Modules/_hacl/Hacl_Hash_SHA2.h:35:
In file included from ../../Modules/_hacl/include/krml/types.h:12:
../../Modules/_hacl/include/krml/lowstar_endianness.h:141:11: warning: 'le64toh' macro redefined [-Wmacro-redefined]
141 | # define le64toh(x) (x)
| ^
/opt/wasi-sdk-24.0-x86_64-linux/bin/../share/wasi-sysroot/include/wasm32-wasi/endian.h:46:9: note: previous definition is here
46 | #define le64toh(x) (uint64_t)(x)
| ^
In file included from ../../Modules/sha2module.c:48:
In file included from ../../Modules/_hacl/Hacl_Hash_SHA2.h:35:
In file included from ../../Modules/_hacl/include/krml/types.h:12:
../../Modules/_hacl/include/krml/lowstar_endianness.h:142:11: warning: 'htobe64' macro redefined [-Wmacro-redefined]
142 | # define htobe64(x)
| ^
/opt/wasi-sdk-24.0-x86_64-linux/bin/../share/wasi-sysroot/include/wasm32-wasi/endian.h:39:9: note: previous definition is here
39 | #define htobe64(x) __bswap64(x)
| ^
In file included from ../../Modules/sha2module.c:48:
In file included from ../../Modules/_hacl/Hacl_Hash_SHA2.h:35:
In file included from ../../Modules/_hacl/include/krml/types.h:12:
../../Modules/_hacl/include/krml/lowstar_endianness.h:149:11: warning: 'be64toh' macro redefined [-Wmacro-redefined]
149 | # define be64toh(x) (htobe64((x)))
| ^
/opt/wasi-sdk-24.0-x86_64-linux/bin/../share/wasi-sysroot/include/wasm32-wasi/endian.h:40:9: note: previous definition is here
40 | #define be64toh(x) __bswap64(x)
| ^
8 warnings generated.
PLEASE submit a bug report to https://github.com/llvm/llvm-project/issues/ and include the crash backtrace.
clang: error: unable to execute command: Bus error
clang: error: linker command failed due to signal (use -v to see invocation)
make: *** [Makefile:996: python.wasm] Error 1
Traceback (most recent call last):
File "/buildarea/3.13.bcannon-wasi.wasi.debug/build/Tools/wasm/wasi.py", line 476, in <module>
main()
~~~~^^
File "/buildarea/3.13.bcannon-wasi.wasi.debug/build/Tools/wasm/wasi.py", line 472, in main
dispatchcontext.subcommand
~~~~~~~~~~~~~~~~~~~~~~~~~~~~^^^^^^^^^
File "/buildarea/3.13.bcannon-wasi.wasi.debug/build/Tools/wasm/wasi.py", line 92, in wrapper
return func(context, working_dir)
File "/buildarea/3.13.bcannon-wasi.wasi.debug/build/Tools/wasm/wasi.py", line 310, in make_wasi_python
call(
~~~~^
["make", "--jobs", str(cpu_count()), "all"],
^^^^^^^^^^^^^^^^^^^^^^^^^^^^^^^^^^^^^^^^^^^^
env=updated_env(),
^^^^^^^^^^^^^^^^^^
quiet=context.quiet,
^^^^^^^^^^^^^^^^^^^^
)
^
File "/buildarea/3.13.bcannon-wasi.wasi.debug/build/Tools/wasm/wasi.py", line 119, in call
subprocess.check_call(command, **kwargs, stdout=stdout, stderr=stderr)
~~~~~~~~~~~~~~~~~~~~~^^^^^^^^^^^^^^^^^^^^^^^^^^^^^^^^^^^^^^^^^^^^^^^^^
File "/usr/lib64/python3.14/subprocess.py", line 420, in check_call
raise CalledProcessError(retcode, cmd)
subprocess.CalledProcessError: Command '['make', '--jobs', '4', 'all']' returned non-zero exit status 2.
Test report
Sincerely, -The Buildbot
participants (1)
-
buildbot@python.org