☠ Buildbot (Python): python/cpython - failed test (failure) uploading test-results.xml (failure) (3.12)
The Buildbot has detected a new failure on builder s390x Fedora LTO + PGO 3.12 while building python/cpython. Full details are available at: https://buildbot.python.org/all/#/builders/1179/builds/90
Buildbot URL: https://buildbot.python.org/all/
Worker for this Build: edelsohn-fedora-z
Build Reason: <unknown> Blamelist: Alex Waygood <Alex.Waygood@Gmail.com>, Barney Gale <barney.gale@gmail.com>, Eric Snow <ericsnowcurrently@gmail.com>, Erlend E. Aasland <erlend.aasland@protonmail.com>, Kumar Aditya <59607654+kumaraditya303@users.noreply.github.com>, Miro Hrončok <miro@hroncok.cz>, Miss Islington (bot) <31488909+miss-islington@users.noreply.github.com>, Pablo Galindo Salgado <Pablogsal@gmail.com>, Serhiy Storchaka <storchaka@gmail.com>, Thomas Wouters <thomas@python.org>
BUILD FAILED: failed test (failure) uploading test-results.xml (failure)
Summary of the results of the build (if available):
==
Captured traceback
Traceback (most recent call last): File "/home/dje/cpython-buildarea/3.12.edelsohn-fedora-z.lto-pgo/build/Lib/test/test_tools/test_freeze.py", line 27, in test_freeze_simple_script outdir, scriptfile, python = helper.prepare(script, outdir) ^^^^^^^^^^^^^^^^^^^^^^^^^^^^^^ File "/home/dje/cpython-buildarea/3.12.edelsohn-fedora-z.lto-pgo/build/Tools/freeze/test/freeze.py", line 146, in prepare copy_source_tree(srcdir, SRCDIR) File "/home/dje/cpython-buildarea/3.12.edelsohn-fedora-z.lto-pgo/build/Tools/freeze/test/freeze.py", line 95, in copy_source_tree shutil.copytree(oldroot, newroot, ignore=ignore_non_src) File "/home/dje/cpython-buildarea/3.12.edelsohn-fedora-z.lto-pgo/build/Lib/shutil.py", line 588, in copytree return _copytree(entries=entries, src=src, dst=dst, symlinks=symlinks, ^^^^^^^^^^^^^^^^^^^^^^^^^^^^^^^^^^^^^^^^^^^^^^^^^^^^^^^^^^^^^^^ File "/home/dje/cpython-buildarea/3.12.edelsohn-fedora-z.lto-pgo/build/Lib/shutil.py", line 542, in _copytree raise Error(errors) shutil.Error: [('/home/dje/cpython-buildarea/3.12.edelsohn-fedora-z.lto-pgo/build/build/test_python_2099480æ/test_python_worker_2108066æ/tempcwd/env/lib64/python3.12/site-packages/pip/_vendor/tomli/_parser.py', '/tmp/test_python_q5o92jx2/tmpgiqz95kg/cpython/build/test_python_2099480æ/test_python_worker_2108066æ/tempcwd/env/lib64/python3.12/site-packages/pip/_vendor/tomli/_parser.py', "[Errno 2] No such file or directory: '/home/dje/cpython-buildarea/3.12.edelsohn-fedora-z.lto-pgo/build/build/test_python_2099480æ/test_python_worker_2108066æ/tempcwd/env/lib64/python3.12/site-packages/pip/_vendor/tomli/_parser.py'"), ('/home/dje/cpython-buildarea/3.12.edelsohn-fedora-z.lto-pgo/build/build/test_python_2099480æ/test_python_worker_2108066æ/tempcwd/env/lib64/python3.12/site-packages/pip/_vendor/tomli/_re.py', '/tmp/test_python_q5o92jx2/tmpgiqz95kg/cpython/build/test_python_2099480æ/test_python_worker_2108066æ/tempcwd/env/lib64/python3.12/site-packages/pip/_vendor/tomli/_re.py', "[ Errno 2] No such file or directory: '/home/dje/cpython-buildarea/3.12.edelsohn-fedora-z.lto-pgo/build/build/test_python_2099480æ/test_python_worker_2108066æ/tempcwd/env/lib64/python3.12/site-packages/pip/_vendor/tomli/_re.py'"), ('/home/dje/cpython-buildarea/3.12.edelsohn-fedora-z.lto-pgo/build/build/test_python_2099480æ/test_python_worker_2108066æ/tempcwd/env/lib64/python3.12/site-packages/pip/_vendor/tomli/_types.py', '/tmp/test_python_q5o92jx2/tmpgiqz95kg/cpython/build/test_python_2099480æ/test_python_worker_2108066æ/tempcwd/env/lib64/python3.12/site-packages/pip/_vendor/tomli/_types.py', "[Errno 2] No such file or directory: '/home/dje/cpython-buildarea/3.12.edelsohn-fedora-z.lto-pgo/build/build/test_python_2099480æ/test_python_worker_2108066æ/tempcwd/env/lib64/python3.12/site-packages/pip/_vendor/tomli/_types.py'"), (<DirEntry 'tomli'>, '/tmp/test_python_q5o92jx2/tmpgiqz95kg/cpython/build/test_python_2099480æ/test_python_worker_2108066æ/tempcwd/env/lib64/python3.12/si te-packages/pip/_vendor/tomli', "[Errno 2] No such file or directory: '/home/dje/cpython-buildarea/3.12.edelsohn-fedora-z.lto-pgo/build/build/test_python_2099480æ/test_python_worker_2108066æ/tempcwd/env/lib64/python3.12/site-packages/pip/_vendor/tomli'"), ('/home/dje/cpython-buildarea/3.12.edelsohn-fedora-z.lto-pgo/build/build/test_python_2099480æ/test_python_worker_2108066æ/tempcwd/env/lib64/python3.12/site-packages/pip/_vendor/urllib3/exceptions.py', '/tmp/test_python_q5o92jx2/tmpgiqz95kg/cpython/build/test_python_2099480æ/test_python_worker_2108066æ/tempcwd/env/lib64/python3.12/site-packages/pip/_vendor/urllib3/exceptions.py', "[Errno 2] No such file or directory: '/home/dje/cpython-buildarea/3.12.edelsohn-fedora-z.lto-pgo/build/build/test_python_2099480æ/test_python_worker_2108066æ/tempcwd/env/lib64/python3.12/site-packages/pip/_vendor/urllib3/exceptions.py'"), ('/home/dje/cpython-buildarea/3.12.edelsohn-fedora-z.lto-pgo/build/build/test_python_2099480æ/test_python_work er_2108066æ/tempcwd/env/lib64/python3.12/site-packages/pip/_vendor/urllib3/fields.py', '/tmp/test_python_q5o92jx2/tmpgiqz95kg/cpython/build/test_python_2099480æ/test_python_worker_2108066æ/tempcwd/env/lib64/python3.12/site-packages/pip/_vendor/urllib3/fields.py', "[Errno 2] No such file or directory: '/home/dje/cpython-buildarea/3.12.edelsohn-fedora-z.lto-pgo/build/build/test_python_2099480æ/test_python_worker_2108066æ/tempcwd/env/lib64/python3.12/site-packages/pip/_vendor/urllib3/fields.py'"), ('/home/dje/cpython-buildarea/3.12.edelsohn-fedora-z.lto-pgo/build/build/test_python_2099480æ/test_python_worker_2108066æ/tempcwd/env/lib64/python3.12/site-packages/pip/_vendor/urllib3/filepost.py', '/tmp/test_python_q5o92jx2/tmpgiqz95kg/cpython/build/test_python_2099480æ/test_python_worker_2108066æ/tempcwd/env/lib64/python3.12/site-packages/pip/_vendor/urllib3/filepost.py', "[Errno 2] No such file or directory: '/home/dje/cpython-buildarea/3.12.edelsohn-fedora-z.lto-pgo/build/build/ test_python_2099480æ/test_python_worker_2108066æ/tempcwd/env/lib64/python3.12/site-packages/pip/_vendor/urllib3/filepost.py'"), ('/home/dje/cpyt
Test report
Failed tests:
- test_tools
Failed subtests:
- test_freeze_simple_script - test.test_tools.test_freeze.TestFreeze.test_freeze_simple_script
Sincerely, -The BuildbotThe Buildbot has detected a new failure on builder s390x Fedora Rawhide LTO 3.12 while building python/cpython. Full details are available at: https://buildbot.python.org/all/#/builders/1128/builds/98
Buildbot URL: https://buildbot.python.org/all/
Worker for this Build: edelsohn-fedora-rawhide-z
Build Reason: <unknown> Blamelist: Miss Islington (bot) <31488909+miss-islington@users.noreply.github.com>
BUILD FAILED: failed test (failure)
Summary of the results of the build (if available):
== Tests result: FAILURE then FAILURE ==
446 tests OK.
10 slowest tests:
- test_tools: 4 min 15 sec
- test_concurrent_futures: 2 min 10 sec
- test_multiprocessing_spawn: 1 min 26 sec
- test_signal: 1 min 15 sec
- test_multiprocessing_forkserver: 1 min 9 sec
- test_multiprocessing_fork: 1 min 2 sec
- test_socket: 48.0 sec
- test_io: 34.0 sec
- test_imaplib: 32.1 sec
- test_math: 30.9 sec
1 test failed: test_tools
20 tests skipped: test.test_asyncio.test_windows_events test.test_asyncio.test_windows_utils test_devpoll test_gdb test_ioctl test_kqueue test_launcher test_msilib test_nis test_peg_generator test_perf_profiler test_startfile test_tix test_tkinter test_ttk test_winconsoleio test_winreg test_winsound test_wmi test_zipfile64
1 re-run test: test_tools
Total duration: 11 min 5 sec
Captured traceback
Traceback (most recent call last): File "<string>", line 1, in <module> File "/tmp/test_python__28ef_m9/tmp_x_emcav/cpython/Lib/sysconfig.py", line 740, in get_config_var return get_config_vars().get(name) ^^^^^^^^^^^^^^^^^ File "/tmp/test_python__28ef_m9/tmp_x_emcav/cpython/Lib/sysconfig.py", line 723, in get_config_vars _init_config_vars() File "/tmp/test_python__28ef_m9/tmp_x_emcav/cpython/Lib/sysconfig.py", line 670, in _init_config_vars _init_posix(_CONFIG_VARS) File "/tmp/test_python__28ef_m9/tmp_x_emcav/cpython/Lib/sysconfig.py", line 536, in _init_posix _temp = __import__(name, globals(), locals(), ['build_time_vars'], 0) ^^^^^^^^^^^^^^^^^^^^^^^^^^^^^^^^^^^^^^^^^^^^^^^^^^^^^^^^^^^^^ ModuleNotFoundError: No module named '_sysconfigdata__linux_s390x-linux-gnu'
Traceback (most recent call last): File "/home/dje/cpython-buildarea/3.12.edelsohn-fedora-rawhide-z.lto/build/Lib/test/test_tools/test_freeze.py", line 27, in test_freeze_simple_script outdir, scriptfile, python = helper.prepare(script, outdir) ^^^^^^^^^^^^^^^^^^^^^^^^^^^^^^ File "/home/dje/cpython-buildarea/3.12.edelsohn-fedora-rawhide-z.lto/build/Tools/freeze/test/freeze.py", line 180, in prepare _run_quiet([MAKE, '-C', builddir, parallel]) File "/home/dje/cpython-buildarea/3.12.edelsohn-fedora-rawhide-z.lto/build/Tools/freeze/test/freeze.py", line 25, in _run_quiet return subprocess.run( ^^^^^^^^^^^^^^^ File "/home/dje/cpython-buildarea/3.12.edelsohn-fedora-rawhide-z.lto/build/Lib/subprocess.py", line 571, in run raise CalledProcessError(retcode, process.args, subprocess.CalledProcessError: Command '['/usr/bin/make', '-C', '/tmp/tmpgu7y7umy/python-build', '-j2']' returned non-zero exit status 2.
Traceback (most recent call last): File "/home/dje/cpython-buildarea/3.12.edelsohn-fedora-rawhide-z.lto/build/Lib/test/test_tools/test_freeze.py", line 27, in test_freeze_simple_script outdir, scriptfile, python = helper.prepare(script, outdir) ^^^^^^^^^^^^^^^^^^^^^^^^^^^^^^ File "/home/dje/cpython-buildarea/3.12.edelsohn-fedora-rawhide-z.lto/build/Tools/freeze/test/freeze.py", line 180, in prepare _run_quiet([MAKE, '-C', builddir, parallel]) File "/home/dje/cpython-buildarea/3.12.edelsohn-fedora-rawhide-z.lto/build/Tools/freeze/test/freeze.py", line 25, in _run_quiet return subprocess.run( ^^^^^^^^^^^^^^^ File "/home/dje/cpython-buildarea/3.12.edelsohn-fedora-rawhide-z.lto/build/Lib/subprocess.py", line 571, in run raise CalledProcessError(retcode, process.args, subprocess.CalledProcessError: Command '['/usr/bin/make', '-C', '/tmp/test_python__28ef_m9/tmp_x_emcav/python-build', '-j2']' returned non-zero exit status 2.
Traceback (most recent call last): File "<string>", line 1, in <module> File "/tmp/tmpgu7y7umy/cpython/Lib/sysconfig.py", line 740, in get_config_var return get_config_vars().get(name) ^^^^^^^^^^^^^^^^^ File "/tmp/tmpgu7y7umy/cpython/Lib/sysconfig.py", line 723, in get_config_vars _init_config_vars() File "/tmp/tmpgu7y7umy/cpython/Lib/sysconfig.py", line 670, in _init_config_vars _init_posix(_CONFIG_VARS) File "/tmp/tmpgu7y7umy/cpython/Lib/sysconfig.py", line 536, in _init_posix _temp = __import__(name, globals(), locals(), ['build_time_vars'], 0) ^^^^^^^^^^^^^^^^^^^^^^^^^^^^^^^^^^^^^^^^^^^^^^^^^^^^^^^^^^^^^ ModuleNotFoundError: No module named '_sysconfigdata__linux_s390x-linux-gnu'
Test report
Failed tests:
- test_tools
Failed subtests:
- test_freeze_simple_script - test.test_tools.test_freeze.TestFreeze.test_freeze_simple_script
Sincerely, -The BuildbotThe Buildbot has detected a new failure on builder PPC64LE RHEL8 3.12 while building python/cpython. Full details are available at: https://buildbot.python.org/all/#/builders/1110/builds/71
Buildbot URL: https://buildbot.python.org/all/
Worker for this Build: cstratak-RHEL8-ppc64le
Build Reason: <unknown> Blamelist: Alex Waygood <Alex.Waygood@Gmail.com>, Barney Gale <barney.gale@gmail.com>, Eric Snow <ericsnowcurrently@gmail.com>, Erlend E. Aasland <erlend.aasland@protonmail.com>, Kumar Aditya <59607654+kumaraditya303@users.noreply.github.com>, Miro Hrončok <miro@hroncok.cz>, Miss Islington (bot) <31488909+miss-islington@users.noreply.github.com>, Pablo Galindo Salgado <Pablogsal@gmail.com>, Serhiy Storchaka <storchaka@gmail.com>, Thomas Wouters <thomas@python.org>
BUILD FAILED: failed test (failure) uploading test-results.xml (failure)
Summary of the results of the build (if available):
==
Captured traceback
remote: Enumerating objects: 32, done.
remote: Counting objects: 3% (1/26)
remote: Counting objects: 7% (2/26)
remote: Counting objects: 11% (3/26)
remote: Counting objects: 15% (4/26)
remote: Counting objects: 19% (5/26)
remote: Counting objects: 23% (6/26)
remote: Counting objects: 26% (7/26)
remote: Counting objects: 30% (8/26)
remote: Counting objects: 34% (9/26)
remote: Counting objects: 38% (10/26)
remote: Counting objects: 42% (11/26)
remote: Counting objects: 46% (12/26)
remote: Counting objects: 50% (13/26)
remote: Counting objects: 53% (14/26)
remote: Counting objects: 57% (15/26)
remote: Counting objects: 61% (16/26)
remote: Counting objects: 65% (17/26)
remote: Counting objects: 69% (18/26)
remote: Counting objects: 73% (19/26)
remote: Counting objects: 76% (20/26)
remote: Counting objects: 80% (21/26)
remote: Counting objects: 84% (22/26)
remote: Counting objects: 88% (23/26)
remote: Counting objects: 92% (24/26)
remote: Counting objects: 96% (25/26)
remote: Counting objects: 100% (26/26)
remote: Counting objects: 100% (26/26), done.
remote: Compressing objects: 5% (1/20)
remote: Compressing objects: 10% (2/20)
remote: Compressing objects: 15% (3/20)
remote: Compressing objects: 20% (4/20)
remote: Compressing objects: 25% (5/20)
remote: Compressing objects: 30% (6/20)
remote: Compressing objects: 35% (7/20)
remote: Compressing objects: 40% (8/20)
remote: Compressing objects: 45% (9/20)
remote: Compressing objects: 50% (10/20)
remote: Compressing objects: 55% (11/20)
remote: Compressing objects: 60% (12/20)
remote: Compressing objects: 65% (13/20)
remote: Compressing objects: 70% (14/20)
remote: Compressing objects: 75% (15/20)
remote: Compressing objects: 80% (16/20)
remote: Compressing objects: 85% (17/20)
remote: Compressing objects: 90% (18/20)
remote: Compressing objects: 95% (19/20)
remote: Compressing objects: 100% (20/20)
remote: Compressing objects: 100% (20/20), done.
remote: Total 32 (delta 6), reused 15 (delta 6), pack-reused 6
From https://github.com/python/cpython
- branch 3.12 -> FETCH_HEAD
- [new tag] 3.7 -> 3.7 Note: switching to '0373c2ccd5f60dd7b6435879e2f8c1b9ed879a3a'.
You are in 'detached HEAD' state. You can look around, make experimental changes and commit them, and you can discard any commits you make in this state without impacting any branches by switching back to a branch.
If you want to create a new branch to retain commits you create, you may do so (now or later) by using -c with the switch command. Example:
git switch -c <new-branch-name>
Or undo this operation with:
git switch -
Turn off this advice by setting config variable advice.detachedHead to false
HEAD is now at 0373c2ccd5 [3.12] Fix c-analyzer for GCC: ignore LANG env var (GH-106173) (#106178) Switched to and reset branch '3.12'
Timeout (0:15:00)! Thread 0x00007fffb6614d70 (most recent call first): File "/home/buildbot/buildarea/3.12.cstratak-RHEL8-ppc64le/build/Lib/selectors.py", line 415 in select File "/home/buildbot/buildarea/3.12.cstratak-RHEL8-ppc64le/build/Lib/subprocess.py", line 2108 in _communicate File "/home/buildbot/buildarea/3.12.cstratak-RHEL8-ppc64le/build/Lib/subprocess.py", line 1209 in communicate File "/home/buildbot/buildarea/3.12.cstratak-RHEL8-ppc64le/build/Lib/test/test_gdb.py", line 112 in run_gdb File "/home/buildbot/buildarea/3.12.cstratak-RHEL8-ppc64le/build/Lib/test/test_gdb.py", line 229 in get_stack_trace File "/home/buildbot/buildarea/3.12.cstratak-RHEL8-ppc64le/build/Lib/test/test_gdb.py", line 947 in test_pycfunction File "/home/buildbot/buildarea/3.12.cstratak-RHEL8-ppc64le/build/Lib/unittest/case.py", line 589 in _callTestMethod File "/home/buildbot/buildarea/3.12.cstratak-RHEL8-ppc64le/build/Lib/unittest/case.py", line 634 in run File "/home/buildbot/buildarea/3.12.cstratak-RHEL8-ppc64le/build/Lib/unittest/case.py", line 690 in __call__ File "/home/buildbot/buildarea/3.12.cstratak-RHEL8-ppc64le/build/Lib/unittest/suite.py", line 122 in run File "/home/buildbot/buildarea/3.12.cstratak-RHEL8-ppc64le/build/Lib/unittest/suite.py", line 84 in __call__ File "/home/buildbot/buildarea/3.12.cstratak-RHEL8-ppc64le/build/Lib/unittest/suite.py", line 122 in run File "/home/buildbot/buildarea/3.12.cstratak-RHEL8-ppc64le/build/Lib/unittest/suite.py", line 84 in __call__ File "/home/buildbot/buildarea/3.12.cstratak-RHEL8-ppc64le/build/Lib/unittest/suite.py", line 122 in run File "/home/buildbot/buildarea/3.12.cstratak-RHEL8-ppc64le/build/Lib/unittest/suite.py", line 84 in __call__ File "/home/buildbot/buildarea/3.12.cstratak-RHEL8-ppc64le/build/Lib/unittest/runner.py", line 240 in run File "/home/buildbot/buildarea/3.12.cstratak-RHEL8-ppc64le/build/Lib/test/support/__init__.py", line 1115 in _run_suite File "/home/buildbot/buildarea/3.12.cstratak-RHEL8-ppc64le/build/Lib/test/support/__init__.py", line 1241 in run_unittest File "/home/buildbot/buildarea/3.12.cstratak-RHEL8-ppc64le/build/Lib/test/libregrtest/runtest.py", line 294 in _test_module File "/home/buildbot/buildarea/3.12.cstratak-RHEL8-ppc64le/build/Lib/test/libregrtest/runtest.py", line 330 in _runtest_inner2 File "/home/buildbot/buildarea/3.12.cstratak-RHEL8-ppc64le/build/Lib/test/libregrtest/runtest.py", line 373 in _runtest_inner File "/home/buildbot/buildarea/3.12.cstratak-RHEL8-ppc64le/build/Lib/test/libregrtest/runtest.py", line 248 in _runtest File "/home/buildbot/buildarea/3.12.cstratak-RHEL8-ppc64le/build/Lib/test/libregrtest/runtest.py", line 278 in runtest File "/home/buildbot/buildarea/3.12.cstratak-RHEL8-ppc64le/build/Lib/test/libregrtest/main.py", line 365 in rerun_failed_tests File "/home/buildbot/buildarea/3.12.cstratak-RHEL8-ppc64le/build/Lib/test/libregrtest/main.py", line 783 in _main File "/home/buildbot/buildarea/3.12.cstratak-RHEL8-ppc64le/build/Lib/test/libregrtest/main.py", line 738 in main File "/home/buildbot/buildarea/3.12.cstratak-RHEL8-ppc64le/build/Lib/test/libregrtest/main.py", line 802 in main File "/home/buildbot/buildarea/3.12.cstratak-RHEL8-ppc64le/build/Lib/test/__main__.py", line 2 in <module> File "/home/buildbot/buildarea/3.12.cstratak-RHEL8-ppc64le/build/Lib/runpy.py", line 88 in _run_code File "/home/buildbot/buildarea/3.12.cstratak-RHEL8-ppc64le/build/Lib/runpy.py", line 198 in _run_module_as_main make: *** [Makefile:2015: buildbottest] Error 1
Cannot open file '/home/buildbot/buildarea/3.12.cstratak-RHEL8-ppc64le/build/build_oot/test-results.xml' for upload
Test report
Failed tests:
- test_gdb
Sincerely, -The Buildbot
participants (1)
-
buildbot@python.org