[Buildbot-status]Buildbot failure in Python on AMD64 Windows8.1 Non-Debug 3.7
The Buildbot has detected a new failure on builder AMD64 Windows8.1 Non-Debug 3.7 while building python/cpython. Full details are available at: https://buildbot.python.org/all/#builders/133/builds/779
Buildbot URL: https://buildbot.python.org/all/
Worker for this Build: ware-win81-release
Build Reason: <unknown> Blamelist: Miss Islington (bot) <31488909+miss-islington@users.noreply.github.com>
BUILD FAILED: failed compile (failure)
Sincerely, -The Buildbot
On Dec 18, 2018, at 10:36, buildbot@python.org wrote:
The Buildbot has detected a new failure on builder AMD64 Windows8.1 Non-Debug 3.7 while building python/cpython. Full details are available at: https://buildbot.python.org/all/#builders/133/builds/779
Buildbot URL: https://buildbot.python.org/all/
Worker for this Build: ware-win81-release
Build Reason: <unknown> Blamelist: Miss Islington (bot) <31488909+miss-islington@users.noreply.github.com>
BUILD FAILED: failed compile (failure)
I just noticed that builds on this buildbot have been failing since then and not making it past the compile step. It looks like it is hung up on a busy file, perhaps a stuck process or something?
-- Ned Deily nad@python.org -- []
On Sun, Dec 23, 2018 at 1:50 PM Ned Deily <nad@python.org> wrote:
On Dec 18, 2018, at 10:36, buildbot@python.org wrote:
The Buildbot has detected a new failure on builder AMD64 Windows8.1 Non-Debug 3.7 while building python/cpython. Full details are available at: https://buildbot.python.org/all/#builders/133/builds/779
Buildbot URL: https://buildbot.python.org/all/
Worker for this Build: ware-win81-release
Build Reason: <unknown> Blamelist: Miss Islington (bot) <31488909+miss-islington@users.noreply.github.com>
BUILD FAILED: failed compile (failure)
I just noticed that builds on this buildbot have been failing since then and not making it past the compile step. It looks like it is hung up on a busy file, perhaps a stuck process or something?
I've killed the offending process.
-- Zach
On Dec 23, 2018, at 17:13, Zachary Ware <zachary.ware@gmail.com> wrote:
On Sun, Dec 23, 2018 at 1:50 PM Ned Deily <nad@python.org> wrote:
I just noticed that builds on this buildbot have been failing since then and not making it past the compile step. It looks like it is hung up on a busy file, perhaps a stuck process or something? I've killed the offending process.
Thanks, Zach!
-- Ned Deily nad@python.org -- []
participants (3)
-
buildbot@python.org -
Ned Deily -
Zachary Ware