Buildbot failure in Python on AMD64 Fedora Stable Clang 3.x
The Buildbot has detected a failed build on builder AMD64 Fedora Stable Clang 3.x while building python/cpython. Full details are available at: https://buildbot.python.org/all/#builders/441/builds/214
Buildbot URL: https://buildbot.python.org/all/
Worker for this Build: cstratak-fedora-stable-x86_64
Build Reason: <unknown> Blamelist: Alexey Izbyshev <izbyshev@ispras.ru>, kj <28750310+Fidget-Spinner@users.noreply.github.com>
BUILD FAILED: failed test (failure)
Summary of the results of the build (if available):
== Tests result: FAILURE then FAILURE ==
410 tests OK.
10 slowest tests:
- test_peg_generator: 3 min 37 sec
- test_shelve: 2 min 51 sec
- test_mailbox: 2 min 42 sec
- test_concurrent_futures: 2 min 42 sec
- test_tokenize: 1 min 18 sec
- test_multiprocessing_spawn: 1 min 13 sec
- test_asyncio: 1 min 9 sec
- test_multiprocessing_forkserver: 1 min 6 sec
- test_multiprocessing_fork: 54.1 sec
- test_io: 49.8 sec
1 test failed: test_zipimport
13 tests skipped: test_devpoll test_ioctl test_kqueue test_msilib test_ossaudiodev test_startfile test_tix test_tk test_ttk_guionly test_winconsoleio test_winreg test_winsound test_zipfile64
1 re-run test: test_zipimport
Total duration: 4 min 45 sec
Captured traceback
Traceback (most recent call last): File "/home/buildbot/buildarea/3.x.cstratak-fedora-stable-x86_64.clang/build/Lib/test/test_zipimport.py", line 194, in testBoth self.doTest(pyc_ext, files, TESTMOD) File "/home/buildbot/buildarea/3.x.cstratak-fedora-stable-x86_64.clang/build/Lib/test/test_zipimport.py", line 148, in doTest self.assertEqual(file, os.path.join(TEMP_ZIP, AssertionError: '/hom[91 chars]5æ/test_python_worker_3608788æ/junk95142.zip/ziptestmodule.py' != '/hom[91 chars]5æ/test_python_worker_3608788æ/junk95142.zip/ziptestmodule.pyc'
- /home/buildbot/buildarea/3.x.cstratak-fedora-stable-x86_64.clang/build/build/test_python_3595635æ/test_python_worker_3608788æ/junk95142.zip/ziptestmodule.py
- /home/buildbot/buildarea/3.x.cstratak-fedora-stable-x86_64.clang/build/build/test_python_3595635æ/test_python_worker_3608788æ/junk95142.zip/ziptestmodule.pyc ? +
Traceback (test.test_zipimport.CompressedZipImportTestCase) ... ok
Traceback (most recent call last): File "/home/buildbot/buildarea/3.x.cstratak-fedora-stable-x86_64.clang/build/Lib/test/test_zipimport.py", line 594, in testGetCompiledSource self.doTest(pyc_ext, files, TESTMOD, call=self.assertModuleSource) File "/home/buildbot/buildarea/3.x.cstratak-fedora-stable-x86_64.clang/build/Lib/test/test_zipimport.py", line 148, in doTest self.assertEqual(file, os.path.join(TEMP_ZIP, AssertionError: '/hom[91 chars]5æ/test_python_worker_3608788æ/junk95142.zip/ziptestmodule.py' != '/hom[91 chars]5æ/test_python_worker_3608788æ/junk95142.zip/ziptestmodule.pyc'
- /home/buildbot/buildarea/3.x.cstratak-fedora-stable-x86_64.clang/build/build/test_python_3595635æ/test_python_worker_3608788æ/junk95142.zip/ziptestmodule.py
- /home/buildbot/buildarea/3.x.cstratak-fedora-stable-x86_64.clang/build/build/test_python_3595635æ/test_python_worker_3608788æ/junk95142.zip/ziptestmodule.pyc ? +
Traceback (most recent call last): File "/home/buildbot/buildarea/3.x.cstratak-fedora-stable-x86_64.clang/build/Lib/test/test_zipimport.py", line 594, in testGetCompiledSource self.doTest(pyc_ext, files, TESTMOD, call=self.assertModuleSource) File "/home/buildbot/buildarea/3.x.cstratak-fedora-stable-x86_64.clang/build/Lib/test/test_zipimport.py", line 148, in doTest self.assertEqual(file, os.path.join(TEMP_ZIP, AssertionError: '/hom[63 chars]ild/build/test_python_3595635æ/junk95142.zip/ziptestmodule.py' != '/hom[63 chars]ild/build/test_python_3595635æ/junk95142.zip/ziptestmodule.pyc'
- /home/buildbot/buildarea/3.x.cstratak-fedora-stable-x86_64.clang/build/build/test_python_3595635æ/junk95142.zip/ziptestmodule.py
- /home/buildbot/buildarea/3.x.cstratak-fedora-stable-x86_64.clang/build/build/test_python_3595635æ/junk95142.zip/ziptestmodule.pyc ? +
Traceback (most recent call last): File "/home/buildbot/buildarea/3.x.cstratak-fedora-stable-x86_64.clang/build/Lib/test/test_zipimport.py", line 194, in testBoth self.doTest(pyc_ext, files, TESTMOD) File "/home/buildbot/buildarea/3.x.cstratak-fedora-stable-x86_64.clang/build/Lib/test/test_zipimport.py", line 148, in doTest self.assertEqual(file, os.path.join(TEMP_ZIP, AssertionError: '/hom[63 chars]ild/build/test_python_3595635æ/junk95142.zip/ziptestmodule.py' != '/hom[63 chars]ild/build/test_python_3595635æ/junk95142.zip/ziptestmodule.pyc'
- /home/buildbot/buildarea/3.x.cstratak-fedora-stable-x86_64.clang/build/build/test_python_3595635æ/junk95142.zip/ziptestmodule.py
- /home/buildbot/buildarea/3.x.cstratak-fedora-stable-x86_64.clang/build/build/test_python_3595635æ/junk95142.zip/ziptestmodule.pyc ? +
Traceback (test.test_zipimport.UncompressedZipImportTestCase) ... ok
Test report
Failed tests:
- test_zipimport
Failed subtests:
- testBoth - test.test_zipimport.UncompressedZipImportTestCase
- testGetCompiledSource - test.test_zipimport.UncompressedZipImportTestCase
- testBoth - test.test_zipimport.CompressedZipImportTestCase
- testGetCompiledSource - test.test_zipimport.CompressedZipImportTestCase
Sincerely, -The Buildbot
participants (1)
-
buildbot@python.org