☠ Buildbot (Python): python/cpython - failed compile (failure) (main)
The Buildbot has detected a new failure on builder x86-64 macOS 3.x while building python/cpython. Full details are available at: https://buildbot.python.org/#/builders/366/builds/12109
Buildbot URL: https://buildbot.python.org/
Worker for this Build: billenstein-macos
Build Reason: <unknown> Blamelist: Serhiy Storchaka <storchaka@gmail.com>
BUILD FAILED: failed compile (failure)
Summary of the results of the build (if available):
Captured traceback
remote: Enumerating objects: 24, done.
remote: Counting objects: 5% (1/20)
remote: Counting objects: 10% (2/20)
remote: Counting objects: 15% (3/20)
remote: Counting objects: 20% (4/20)
remote: Counting objects: 25% (5/20)
remote: Counting objects: 30% (6/20)
remote: Counting objects: 35% (7/20)
remote: Counting objects: 40% (8/20)
remote: Counting objects: 45% (9/20)
remote: Counting objects: 50% (10/20)
remote: Counting objects: 55% (11/20)
remote: Counting objects: 60% (12/20)
remote: Counting objects: 65% (13/20)
remote: Counting objects: 70% (14/20)
remote: Counting objects: 75% (15/20)
remote: Counting objects: 80% (16/20)
remote: Counting objects: 85% (17/20)
remote: Counting objects: 90% (18/20)
remote: Counting objects: 95% (19/20)
remote: Counting objects: 100% (20/20)
remote: Counting objects: 100% (20/20), done.
remote: Compressing objects: 5% (1/17)
remote: Compressing objects: 11% (2/17)
remote: Compressing objects: 17% (3/17)
remote: Compressing objects: 23% (4/17)
remote: Compressing objects: 29% (5/17)
remote: Compressing objects: 35% (6/17)
remote: Compressing objects: 41% (7/17)
remote: Compressing objects: 47% (8/17)
remote: Compressing objects: 52% (9/17)
remote: Compressing objects: 58% (10/17)
remote: Compressing objects: 64% (11/17)
remote: Compressing objects: 70% (12/17)
remote: Compressing objects: 76% (13/17)
remote: Compressing objects: 82% (14/17)
remote: Compressing objects: 88% (15/17)
remote: Compressing objects: 94% (16/17)
remote: Compressing objects: 100% (17/17)
remote: Compressing objects: 100% (17/17), done.
remote: Total 24 (delta 6), reused 3 (delta 3), pack-reused 4 (from 1)
From https://github.com/python/cpython
- branch main -> FETCH_HEAD Note: switching to '306d7a7649061d4c88d90deb6838e7e49d03269e'.
You are in 'detached HEAD' state. You can look around, make experimental changes and commit them, and you can discard any commits you make in this state without impacting any branches by switching back to a branch.
If you want to create a new branch to retain commits you create, you may do so (now or later) by using -c with the switch command. Example:
git switch -c <new-branch-name>
Or undo this operation with:
git switch -
Turn off this advice by setting config variable advice.detachedHead to false
HEAD is now at 306d7a76490 gh-152325: Add curses.has_mouse() and curses.window.mouse_trafo() (GH-152484) Switched to and reset branch 'main'
configure: WARNING: pkg-config is missing. Some dependencies may not be detected correctly.
/Library/Developer/CommandLineTools/usr/bin/ranlib: file: libpython3.16d.a(brc.o) has no symbols /Library/Developer/CommandLineTools/usr/bin/ranlib: file: libpython3.16d.a(dynamic_annotations.o) has no symbols /Library/Developer/CommandLineTools/usr/bin/ranlib: file: libpython3.16d.a(gc_free_threading.o) has no symbols /Library/Developer/CommandLineTools/usr/bin/ranlib: file: libpython3.16d.a(index_pool.o) has no symbols /Library/Developer/CommandLineTools/usr/bin/ranlib: file: libpython3.16d.a(jit.o) has no symbols /Library/Developer/CommandLineTools/usr/bin/ranlib: file: libpython3.16d.a(jit_publish.o) has no symbols /Library/Developer/CommandLineTools/usr/bin/ranlib: file: libpython3.16d.a(optimizer_analysis.o) has no symbols /Library/Developer/CommandLineTools/usr/bin/ranlib: file: libpython3.16d.a(optimizer_symbols.o) has no symbols /Library/Developer/CommandLineTools/usr/bin/ranlib: file: libpython3.16d.a(pystats.o) has no symbols /Library/Developer/CommandLineTools/usr/bin/ranlib: file: libpython3.16d.a(stackrefs.o) has no symbols /Library/Developer/CommandLineTools/usr/bin/ranlib: file: libpython3.16d.a(uniqueid.o) has no symbols ld: warning: -undefined dynamic_lookup may not work with chained fixups ld: warning: -undefined dynamic_lookup may not work with chained fixups ld: warning: -undefined dynamic_lookup may not work with chained fixups ld: warning: -undefined dynamic_lookup may not work with chained fixups ld: warning: -undefined dynamic_lookup may not work with chained fixups ld: warning: -undefined dynamic_lookup may not work with chained fixups ld: warning: -undefined dynamic_lookup may not work with chained fixups ld: warning: -undefined dynamic_lookup may not work with chained fixups ld: warning: -undefined dynamic_lookup may not work with chained fixups ld: warning: -undefined dynamic_lookup may not work with chained fixups ld: warning: -undefined dynamic_lookup may not work with chained fixups ld: warning: -undefined dynamic_lookup may not work with chained fixups ld: warning: -undefined dynamic_lookup may not work with chained fixups ld: warning: -undefined dynamic_lookup may not work with chained fixups ld: warning: -undefined dynamic_lookup may not work with chained fixups ld: warning: -undefined dynamic_lookup may not work with chained fixups ld: warning: -undefined dynamic_lookup may not work with chained fixups ld: warning: -undefined dynamic_lookup may not work with chained fixups ld: warning: -undefined dynamic_lookup may not work with chained fixups ld: warning: -undefined dynamic_lookup may not work with chained fixups ld: warning: -undefined dynamic_lookup may not work with chained fixups ld: warning: -undefined dynamic_lookup may not work with chained fixups ld: warning: -undefined dynamic_lookup may not work with chained fixups ld: warning: -undefined dynamic_lookup may not work with chained fixups ld: warning: -undefined dynamic_lookup may not work with chained fixups ld: warning: -undefined dynamic_lookup may not work with chained fixups ld: warning: -undefined dynamic_lookup may not work with chained fixups ld: warning: -undefined dynamic_lookup may not work with chained fixups ld: warning: -undefined dynamic_lookup may not work with chained fixups ld: warning: -undefined dynamic_lookup may not work with chained fixups ld: warning: -undefined dynamic_lookup may not work with chained fixups ld: warning: -undefined dynamic_lookup may not work with chained fixups ld: warning: -undefined dynamic_lookup may not work with chained fixups ld: warning: -undefined dynamic_lookup may not work with chained fixups ld: warning: -undefined dynamic_lookup may not work with chained fixups ld: warning: -undefined dynamic_lookup may not work with chained fixups ld: warning: -undefined dynamic_lookup may not work with chained fixups ld: warning: -undefined dynamic_lookup may not work with chained fixups ld: warning: -undefined dynamic_lookup may not work with chained fixups ld: warning: -undefined dynamic_lookup may not work with chained fixups ld: warning: -undefined dynamic_lookup may not work with chained fixups ld: warning: -undefined dynamic_lookup may not work with chained fixups ld: warning: -undefined dynamic_lookup may not work with chained fixups ld: warning: -undefined dynamic_lookup may not work with chained fixups ld: warning: -undefined dynamic_lookup may not work with chained fixups ld: warning: -undefined dynamic_lookup may not work with chained fixups ld: warning: -undefined dynamic_lookup may not work with chained fixups ld: warning: -undefined dynamic_lookup may not work with chained fixups ld: warning: -undefined dynamic_lookup may not work with chained fixups ld: warning: -undefined dynamic_lookup may not work with chained fixups ld: warning: -undefined dynamic_lookup may not work with chained fixups ld: warning: -undefined dynamic_lookup may not work with chained fixups ld: warning: -undefined dynamic_lookup may not work with chained fixups ./Modules/_cursesmodule.c:2085:35: warning: comparison of integers of different signs: 'attr_t' (aka 'unsigned int') and 'int' [-Wsign-compare] if (wattrset(self->win, attr) == ERR) { ~~~~~~~~~~~~~~~~~~~~~~~~~ ^ ~~~ ./Modules/_cursesmodule.c:7041:28: error: implicit declaration of function 'has_mouse' is invalid in C99 [-Werror,-Wimplicit-function-declaration] return PyBool_FromLong(has_mouse()); ^ 1 warning and 1 error generated. make: *** [Modules/_cursesmodule.o] Error 1
Test report
Sincerely, -The Buildbot
participants (1)
-
buildbot@python.org