☠ Buildbot (Python): - failed test (failure) (623b0d9c598585dd8917b794ae99ce89c6711c5e)
The Buildbot has detected a new failure on builder AMD64 Windows11 Refleaks 3.11 while building Python. Full details are available at: https://buildbot.python.org/all/#/builders/987/builds/443
Buildbot URL: https://buildbot.python.org/all/
Worker for this Build: ware-win11
Build Reason: <unknown> Blamelist:
BUILD FAILED: failed test (failure)
Summary of the results of the build (if available):
Captured traceback
Traceback (most recent call last): File "b:\uildarea\3.11.ware-win11.refleak\build\Lib\test\test___all__.py", line 129, in test_all self.check_all(modname) File "b:\uildarea\3.11.ware-win11.refleak\build\Lib\test\test___all__.py", line 43, in check_all with warnings_helper.check_warnings( File "b:\uildarea\3.11.ware-win11.refleak\build\Lib\contextlib.py", line 144, in __exit__ next(self.gen) File "b:\uildarea\3.11.ware-win11.refleak\build\Lib\test\support\warnings_helper.py", line 185, in _filterwarnings raise AssertionError("unhandled warning %s" % reraise[0]) AssertionError: unhandled warning {message : DeprecationWarning("invalid escape sequence '\\?'"), category : 'DeprecationWarning', filename : 'b:\\uildarea\\3.11.ware-win11.refleak\\build\\Lib\\test\\test_httpservers.py', lineno : 445, line : None}
Test report
Sincerely, -The BuildbotThe Buildbot has detected a new failure on builder s390x Fedora Rawhide Refleaks 3.11 while building Python. Full details are available at: https://buildbot.python.org/all/#/builders/1000/builds/442
Buildbot URL: https://buildbot.python.org/all/
Worker for this Build: edelsohn-fedora-rawhide-z
Build Reason: <unknown> Blamelist:
BUILD FAILED: failed test (failure)
Summary of the results of the build (if available):
== Tests result: FAILURE then FAILURE ==
398 tests OK.
10 slowest tests:
- test_signal: 31 min 1 sec
- test_asyncio: 15 min 18 sec
- test_concurrent_futures: 14 min 56 sec
- test_multiprocessing_spawn: 11 min 44 sec
- test_multiprocessing_forkserver: 8 min 33 sec
- test_multiprocessing_fork: 7 min 4 sec
- test_io: 3 min 34 sec
- test_imaplib: 3 min 13 sec
- test_subprocess: 2 min 57 sec
- test_xmlrpc: 2 min 45 sec
1 test failed: test_tools
15 tests skipped: test_devpoll test_gdb test_ioctl test_kqueue test_launcher test_msilib test_nis test_startfile test_tix test_tk test_ttk_guionly test_winconsoleio test_winreg test_winsound test_zipfile64
23 re-run tests: test_ast test_audioop test_augassign test_codecmaps_hk test_cppext test_doctest test_eof test_faulthandler test_file test_getopt test_int_literal test_json test_keywordonlyarg test_pickle test_range test_sched test_socket test_sort test_syntax test_threading_local test_tools test_type_annotations test_wait3
20 tests run no tests: test_ast test_audioop test_augassign test_codecmaps_hk test_doctest test_eof test_file test_getopt test_int_literal test_json test_keywordonlyarg test_pickle test_range test_sched test_socket test_sort test_syntax test_threading_local test_type_annotations test_wait3
Total duration: 55 min 6 sec
Captured traceback
Traceback (most recent call last): File "/home/dje/cpython-buildarea/3.11.edelsohn-fedora-rawhide-z.refleak/build/Lib/multiprocessing/resource_tracker.py", line 209, in main cache[rtype].remove(name) KeyError: '/psm_dd71281a' .Traceback (most recent call last): File "/home/dje/cpython-buildarea/3.11.edelsohn-fedora-rawhide-z.refleak/build/Lib/multiprocessing/resource_tracker.py", line 209, in main cache[rtype].remove(name) KeyError: '/psm_f33a1949' .Traceback (most recent call last): File "/home/dje/cpython-buildarea/3.11.edelsohn-fedora-rawhide-z.refleak/build/Lib/multiprocessing/resource_tracker.py", line 209, in main cache[rtype].remove(name) KeyError: '/psm_379bf4fd' ..Traceback (most recent call last): File "/home/dje/cpython-buildarea/3.11.edelsohn-fedora-rawhide-z.refleak/build/Lib/multiprocessing/resource_tracker.py", line 209, in main cache[rtype].remove(name) KeyError: '/psm_27b9174d' .Traceback (most recent call last): File "/home/dje/cpython-buildarea/3.11.edelsohn-fedora-rawhide-z.refleak/build/Lib/multiprocessing/resource_tracker.py", line 209, in main cache[rtype].remove(name) KeyError: '/psm_75741fa6' .
Traceback (most recent call last): File "/home/dje/cpython-buildarea/3.11.edelsohn-fedora-rawhide-z.refleak/build/Lib/multiprocessing/util.py", line 300, in _run_finalizers finalizer() File "/home/dje/cpython-buildarea/3.11.edelsohn-fedora-rawhide-z.refleak/build/Lib/multiprocessing/util.py", line 224, in __call__ res = self._callback(*self._args, **self._kwargs) ^^^^^^^^^^^^^^^^^^^^^^^^^^^^^^^^^^^^^^^^^^^ File "/home/dje/cpython-buildarea/3.11.edelsohn-fedora-rawhide-z.refleak/build/Lib/multiprocessing/synchronize.py", line 87, in _cleanup sem_unlink(name) FileNotFoundError: [Errno 2] No such file or directory Traceback (most recent call last): File "/home/dje/cpython-buildarea/3.11.edelsohn-fedora-rawhide-z.refleak/build/Lib/multiprocessing/util.py", line 300, in _run_finalizers finalizer() File "/home/dje/cpython-buildarea/3.11.edelsohn-fedora-rawhide-z.refleak/build/Lib/multiprocessing/util.py", line 224, in __call__ res = self._callback(*self._args, **self._kwargs) ^^^^^^^^^^^^^^^^^^^^^^^^^^^^^^^^^^^^^^^^^^^ File "/home/dje/cpython-buildarea/3.11.edelsohn-fedora-rawhide-z.refleak/build/Lib/multiprocessing/synchronize.py", line 87, in _cleanup sem_unlink(name) FileNotFoundError: [Errno 2] No such file or directory Traceback (most recent call last): File "/home/dje/cpython-buildarea/3.11.edelsohn-fedora-rawhide-z.refleak/build/Lib/multiprocessing/util.py", line 300, in _run_finalizers finalizer() File "/home/dje/cpython-buildarea/3.11.edelsohn-fedora-rawhide-z.refleak/build/Lib/multiprocessing/util.py", line 224, in __call__ res = self._callback(*self._args, **self._kwargs) ^^^^^^^^^^^^^^^^^^^^^^^^^^^^^^^^^^^^^^^^^^^ File "/home/dje/cpython-buildarea/3.11.edelsohn-fedora-rawhide-z.refleak/build/Lib/multiprocessing/synchronize.py", line 87, in _cleanup sem_unlink(name) FileNotFoundError: [Errno 2] No such file or directory Traceback (most recent call last): File "/home/dje/cpython-buildarea/3.11.edelsohn-fedora-rawhide-z.refleak/build/Lib/multiprocessing/util.py", line 300, in _run_finalizers finalizer() File "/home/dje/cpython-buildarea/3.11.edelsohn-fedora-rawhide-z.refleak/build/Lib/multiprocessing/util.py", line 224, in __call__ res = self._callback(*self._args, **self._kwargs) ^^^^^^^^^^^^^^^^^^^^^^^^^^^^^^^^^^^^^^^^^^^ File "/home/dje/cpython-buildarea/3.11.edelsohn-fedora-rawhide-z.refleak/build/Lib/multiprocessing/synchronize.py", line 87, in _cleanup sem_unlink(name) FileNotFoundError: [Errno 2] No such file or directory Traceback (most recent call last): File "/home/dje/cpython-buildarea/3.11.edelsohn-fedora-rawhide-z.refleak/build/Lib/multiprocessing/util.py", line 300, in _run_finalizers finalizer() File "/home/dje/cpython-buildarea/3.11.edelsohn-fedora-rawhide-z.refleak/build/Lib/multiprocessing/util.py", line 224, in __call__ res = self._callback(*self._args, **self._kwargs) ^^^^^^^^^^^^^^^^^^^^^^^^^^^^^^^^^^^^^^^^^^^ File "/home/dje/cpython-buildarea/3.11.edelsohn-fedora-rawhide-z.refleak/build/Lib/multiprocessing/synchronize.py", line 87, in _cleanup sem_unlink(name) FileNotFoundError: [Errno 2] No such file or directory Traceback (most recent call last): File "/home/dje/cpython-buildarea/3.11.edelsohn-fedora-rawhide-z.refleak/build/Lib/multiprocessing/util.py", line 300, in _run_finalizers finalizer() File "/home/dje/cpython-buildarea/3.11.edelsohn-fedora-rawhide-z.refleak/build/Lib/multiprocessing/util.py", line 224, in __call__ res = self._callback(*self._args, **self._kwargs) ^^^^^^^^^^^^^^^^^^^^^^^^^^^^^^^^^^^^^^^^^^^ File "/home/dje/cpython-buildarea/3.11.edelsohn-fedora-rawhide-z.refleak/build/Lib/multiprocessing/synchronize.py", line 87, in _cleanup sem_unlink(name) FileNotFoundError: [Errno 2] No such file or directory ./home/dje/cpython-buildarea/3.11.edelsohn-fedora-rawhide-z.refleak/build/Lib/multiprocessing/resource_tracker.py:224: UserWarning: resource_tracker: There appear to be 6 leaked semaphore objects to clean up at shutdown warnings.warn('resource_tracker: There appear to be %d ' Traceback (most recent call last): File "/home/dje/cpython-buildarea/3.11.edelsohn-fedora-rawhide-z.refleak/build/Lib/multiprocessing/util.py", line 300, in _run_finalizers finalizer() File "/home/dje/cpython-buildarea/3.11.edelsohn-fedora-rawhide-z.refleak/build/Lib/multiprocessing/util.py", line 224, in __call__ res = self._callback(*self._args, **self._kwargs) ^^^^^^^^^^^^^^^^^^^^^^^^^^^^^^^^^^^^^^^^^^^ File "/home/dje/cpython-buildarea/3.11.edelsohn-fedora-rawhide-z.refleak/build/Lib/multiprocessing/synchronize.py", line 87, in _cleanup sem_unlink(name) FileNotFoundError: [Errno 2] No such file or directory Traceback (most recent call last): File "/home/dje/cpython-buildarea/3.11.edelsohn-fedora-rawhide-z.refleak/build/Lib/multiprocessing/util.py", line 300, in _run_finalizers finalizer() File "/home/dje/cpython-buildarea/3.11.edelsohn-fedora-rawhide-z.refleak/build/Lib/multiprocessing/util.py", line 224, in __call__ res = self._callback(*self._args, **self._kwargs) ^^^^^^^^^^^^^^^^^^^^^^^^^^^^^^^^^^^^^^^^^^^ File "/home/dje/cpython-buildarea/3.11.edelsohn-fedora-rawhide-z.refleak/build/Lib/multiprocessing/synchronize.py", line 87, in _cleanup sem_unlink(name) FileNotFoundError: [Errno 2] No such file or directory Traceback (most recent call last): File "/home/dje/cpython-buildarea/3.11.edelsohn-fedora-rawhide-z.refleak/build/Lib/multiprocessing/util.py", line 300, in _run_finalizers finalizer() File "/home/dje/cpython-buildarea/3.11.edelsohn-fedora-rawhide-z.refleak/build/Lib/multiprocessing/util.py", line 224, in __call__ res = self._callback(*self._args, **self._kwargs) ^^^^^^^^^^^^^^^^^^^^^^^^^^^^^^^^^^^^^^^^^^^ File "/home/dje/cpython-buildarea/3.11.edelsohn-fedora-rawhide-z.refleak/build/Lib/multiprocessing/synchronize.py", line 87, in _cleanup sem_unlink(name) FileNotFoundError: [Errno 2] No such file or directory Traceback (most recent call last): File "/home/dje/cpython-buildarea/3.11.edelsohn-fedora-rawhide-z.refleak/build/Lib/multiprocessing/util.py", line 300, in _run_finalizers finalizer() File "/home/dje/cpython-buildarea/3.11.edelsohn-fedora-rawhide-z.refleak/build/Lib/multiprocessing/util.py", line 224, in __call__ res = self._callback(*self._args, **self._kwargs) ^^^^^^^^^^^^^^^^^^^^^^^^^^^^^^^^^^^^^^^^^^^ File "/home/dje/cpython-buildarea/3.11.edelsohn-fedora-rawhide-z.refleak/build/Lib/multiprocessing/synchronize.py", line 87, in _cleanup sem_unlink(name) FileNotFoundError: [Errno 2] No such file or directory Traceback (most recent call last): File "/home/dje/cpython-buildarea/3.11.edelsohn-fedora-rawhide-z.refleak/build/Lib/multiprocessing/util.py", line 300, in _run_finalizers finalizer() File "/home/dje/cpython-buildarea/3.11.edelsohn-fedora-rawhide-z.refleak/build/Lib/multiprocessing/util.py", line 224, in __call__ res = self._callback(*self._args, **self._kwargs) ^^^^^^^^^^^^^^^^^^^^^^^^^^^^^^^^^^^^^^^^^^^ File "/home/dje/cpython-buildarea/3.11.edelsohn-fedora-rawhide-z.refleak/build/Lib/multiprocessing/synchronize.py", line 87, in _cleanup sem_unlink(name) FileNotFoundError: [Errno 2] No such file or directory Traceback (most recent call last): File "/home/dje/cpython-buildarea/3.11.edelsohn-fedora-rawhide-z.refleak/build/Lib/multiprocessing/util.py", line 300, in _run_finalizers finalizer() File "/home/dje/cpython-buildarea/3.11.edelsohn-fedora-rawhide-z.refleak/build/Lib/multiprocessing/util.py", line 224, in __call__ res = self._callback(*self._args, **self._kwargs) ^^^^^^^^^^^^^^^^^^^^^^^^^^^^^^^^^^^^^^^^^^^ File "/home/dje/cpython-buildarea/3.11.edelsohn-fedora-rawhide-z.refleak/build/Lib/multiprocessing/synchronize.py", line 87, in _cleanup sem_unlink(name) FileNotFoundError: [Errno 2] No such file or directory ./home/dje/cpython-buildarea/3.11.edelsohn-fedora-rawhide-z.refleak/build/Lib/multiprocessing/resource_tracker.py:224: UserWarning: resource_tracker: There appear to be 6 leaked semaphore objects to clean up at shutdown warnings.warn('resource_tracker: There appear to be %d ' Traceback (most recent call last): File "/home/dje/cpython-buildarea/3.11.edelsohn-fedora-rawhide-z.refleak/build/Lib/multiprocessing/util.py", line 300, in _run_finalizers finalizer() File "/home/dje/cpython-buildarea/3.11.edelsohn-fedora-rawhide-z.refleak/build/Lib/multiprocessing/util.py", line 224, in __call__ res = self._callback(*self._args, **self._kwargs) ^^^^^^^^^^^^^^^^^^^^^^^^^^^^^^^^^^^^^^^^^^^ File "/home/dje/cpython-buildarea/3.11.edelsohn-fedora-rawhide-z.refleak/build/Lib/multiprocessing/synchronize.py", line 87, in _cleanup sem_unlink(name) FileNotFoundError: [Errno 2] No such file or directory Traceback (most recent call last): File "/home/dje/cpython-buildarea/3.11.edelsohn-fedora-rawhide-z.refleak/build/Lib/multiprocessing/util.py", line 300, in _run_finalizers finalizer() File "/home/dje/cpython-buildarea/3.11.edelsohn-fedora-rawhide-z.refleak/build/Lib/multiprocessing/util.py", line 224, in __call__ res = self._callback(*self._args, **self._kwargs) ^^^^^^^^^^^^^^^^^^^^^^^^^^^^^^^^^^^^^^^^^^^ File "/home/dje/cpython-buildarea/3.11.edelsohn-fedora-rawhide-z.refleak/build/Lib/multiprocessing/synchronize.py", line 87, in _cleanup sem_unlink(name) FileNotFoundError: [Errno 2] No such file or directory Traceback (most recent call last): File "/home/dje/cpython-buildarea/3.11.edelsohn-fedora-rawhide-z.refleak/build/Lib/multiprocessing/util.py", line 300, in _run_finalizers finalizer() File "/home/dje/cpython-buildarea/3.11.edelsohn-fedora-rawhide-z.refleak/build/Lib/multiprocessing/util.py", line 224, in __call__ res = self._callback(*self._args, **self._kwargs) ^^^^^^^^^^^^^^^^^^^^^^^^^^^^^^^^^^^^^^^^^^^ File "/home/dje/cpython-buildarea/3.11.edelsohn-fedora-rawhide-z.refleak/build/Lib/multiprocessing/synchronize.py", line 87, in _cleanup sem_unlink(name) FileNotFoundError: [Errno 2] No such file or directory Traceback (most recent call last): File "/home/dje/cpython-buildarea/3.11.edelsohn-fedora-rawhide-z.refleak/build/Lib/multiprocessing/util.py", line 300, in _run_finalizers finalizer() File "/home/dje/cpython-buildarea/3.11.edelsohn-fedora-rawhide-z.refleak/build/Lib/multiprocessing/util.py", line 224, in __call__ res = self._callback(*self._args, **self._kwargs) ^^^^^^^^^^^^^^^^^^^^^^^^^^^^^^^^^^^^^^^^^^^ File "/home/dje/cpython-buildarea/3.11.edelsohn-fedora-rawhide-z.refleak/build/Lib/multiprocessing/synchronize.py", line 87, in _cleanup sem_unlink(name) FileNotFoundError: [Errno 2] No such file or directory Traceback (most recent call last): File "/home/dje/cpython-buildarea/3.11.edelsohn-fedora-rawhide-z.refleak/build/Lib/multiprocessing/util.py", line 300, in _run_finalizers finalizer() File "/home/dje/cpython-buildarea/3.11.edelsohn-fedora-rawhide-z.refleak/build/Lib/multiprocessing/util.py", line 224, in __call__ res = self._callback(*self._args, **self._kwargs) ^^^^^^^^^^^^^^^^^^^^^^^^^^^^^^^^^^^^^^^^^^^ File "/home/dje/cpython-buildarea/3.11.edelsohn-fedora-rawhide-z.refleak/build/Lib/multiprocessing/synchronize.py", line 87, in _cleanup sem_unlink(name) FileNotFoundError: [Errno 2] No such file or directory Traceback (most recent call last): File "/home/dje/cpython-buildarea/3.11.edelsohn-fedora-rawhide-z.refleak/build/Lib/multiprocessing/util.py", line 300, in _run_finalizers finalizer() File "/home/dje/cpython-buildarea/3.11.edelsohn-fedora-rawhide-z.refleak/build/Lib/multiprocessing/util.py", line 224, in __call__ res = self._callback(*self._args, **self._kwargs) ^^^^^^^^^^^^^^^^^^^^^^^^^^^^^^^^^^^^^^^^^^^ File "/home/dje/cpython-buildarea/3.11.edelsohn-fedora-rawhide-z.refleak/build/Lib/multiprocessing/synchronize.py", line 87, in _cleanup sem_unlink(name) FileNotFoundError: [Errno 2] No such file or directory ./home/dje/cpython-buildarea/3.11.edelsohn-fedora-rawhide-z.refleak/build/Lib/multiprocessing/resource_tracker.py:224: UserWarning: resource_tracker: There appear to be 6 leaked semaphore objects to clean up at shutdown warnings.warn('resource_tracker: There appear to be %d ' Traceback (most recent call last): File "/home/dje/cpython-buildarea/3.11.edelsohn-fedora-rawhide-z.refleak/build/Lib/multiprocessing/util.py", line 300, in _run_finalizers finalizer() File "/home/dje/cpython-buildarea/3.11.edelsohn-fedora-rawhide-z.refleak/build/Lib/multiprocessing/util.py", line 224, in __call__ res = self._callback(*self._args, **self._kwargs) ^^^^^^^^^^^^^^^^^^^^^^^^^^^^^^^^^^^^^^^^^^^ File "/home/dje/cpython-buildarea/3.11.edelsohn-fedora-rawhide-z.refleak/build/Lib/multiprocessing/synchronize.py", line 87, in _cleanup sem_unlink(name) FileNotFoundError: [Errno 2] No such file or directory Traceback (most recent call last): File "/home/dje/cpython-buildarea/3.11.edelsohn-fedora-rawhide-z.refleak/build/Lib/multiprocessing/util.py", line 300, in _run_finalizers finalizer() File "/home/dje/cpython-buildarea/3.11.edelsohn-fedora-rawhide-z.refleak/build/Lib/multiprocessing/util.py", line 224, in __call__ res = self._callback(*self._args, **self._kwargs) ^^^^^^^^^^^^^^^^^^^^^^^^^^^^^^^^^^^^^^^^^^^ File "/home/dje/cpython-buildarea/3.11.edelsohn-fedora-rawhide-z.refleak/build/Lib/multiprocessing/synchronize.py", line 87, in _cleanup sem_unlink(name) FileNotFoundError: [Errno 2] No such file or directory Traceback (most recent call last): File "/home/dje/cpython-buildarea/3.11.edelsohn-fedora-rawhide-z.refleak/build/Lib/multiprocessing/util.py", line 300, in _run_finalizers finalizer() File "/home/dje/cpython-buildarea/3.11.edelsohn-fedora-rawhide-z.refleak/build/Lib/multiprocessing/util.py", line 224, in __call__ res = self._callback(*self._args, **self._kwargs) ^^^^^^^^^^^^^^^^^^^^^^^^^^^^^^^^^^^^^^^^^^^ File "/home/dje/cpython-buildarea/3.11.edelsohn-fedora-rawhide-z.refleak/build/Lib/multiprocessing/synchronize.py", line 87, in _cleanup sem_unlink(name) FileNotFoundError: [Errno 2] No such file or directory Traceback (most recent call last): File "/home/dje/cpython-buildarea/3.11.edelsohn-fedora-rawhide-z.refleak/build/Lib/multiprocessing/util.py", line 300, in _run_finalizers finalizer() File "/home/dje/cpython-buildarea/3.11.edelsohn-fedora-rawhide-z.refleak/build/Lib/multiprocessing/util.py", line 224, in __call__ res = self._callback(*self._args, **self._kwargs) ^^^^^^^^^^^^^^^^^^^^^^^^^^^^^^^^^^^^^^^^^^^ File "/home/dje/cpython-buildarea/3.11.edelsohn-fedora-rawhide-z.refleak/build/Lib/multiprocessing/synchronize.py", line 87, in _cleanup sem_unlink(name) FileNotFoundError: [Errno 2] No such file or directory Traceback (most recent call last): File "/home/dje/cpython-buildarea/3.11.edelsohn-fedora-rawhide-z.refleak/build/Lib/multiprocessing/util.py", line 300, in _run_finalizers finalizer() File "/home/dje/cpython-buildarea/3.11.edelsohn-fedora-rawhide-z.refleak/build/Lib/multiprocessing/util.py", line 224, in __call__ res = self._callback(*self._args, **self._kwargs) ^^^^^^^^^^^^^^^^^^^^^^^^^^^^^^^^^^^^^^^^^^^ File "/home/dje/cpython-buildarea/3.11.edelsohn-fedora-rawhide-z.refleak/build/Lib/multiprocessing/synchronize.py", line 87, in _cleanup sem_unlink(name) FileNotFoundError: [Errno 2] No such file or directory Traceback (most recent call last): File "/home/dje/cpython-buildarea/3.11.edelsohn-fedora-rawhide-z.refleak/build/Lib/multiprocessing/util.py", line 300, in _run_finalizers finalizer() File "/home/dje/cpython-buildarea/3.11.edelsohn-fedora-rawhide-z.refleak/build/Lib/multiprocessing/util.py", line 224, in __call__ res = self._callback(*self._args, **self._kwargs) ^^^^^^^^^^^^^^^^^^^^^^^^^^^^^^^^^^^^^^^^^^^ File "/home/dje/cpython-buildarea/3.11.edelsohn-fedora-rawhide-z.refleak/build/Lib/multiprocessing/synchronize.py", line 87, in _cleanup sem_unlink(name) FileNotFoundError: [Errno 2] No such file or directory ./home/dje/cpython-buildarea/3.11.edelsohn-fedora-rawhide-z.refleak/build/Lib/multiprocessing/resource_tracker.py:224: UserWarning: resource_tracker: There appear to be 6 leaked semaphore objects to clean up at shutdown warnings.warn('resource_tracker: There appear to be %d ' Traceback (most recent call last): File "/home/dje/cpython-buildarea/3.11.edelsohn-fedora-rawhide-z.refleak/build/Lib/multiprocessing/util.py", line 300, in _run_finalizers finalizer() File "/home/dje/cpython-buildarea/3.11.edelsohn-fedora-rawhide-z.refleak/build/Lib/multiprocessing/util.py", line 224, in __call__ res = self._callback(*self._args, **self._kwargs) ^^^^^^^^^^^^^^^^^^^^^^^^^^^^^^^^^^^^^^^^^^^ File "/home/dje/cpython-buildarea/3.11.edelsohn-fedora-rawhide-z.refleak/build/Lib/multiprocessing/synchronize.py", line 87, in _cleanup sem_unlink(name) FileNotFoundError: [Errno 2] No such file or directory Traceback (most recent call last): File "/home/dje/cpython-buildarea/3.11.edelsohn-fedora-rawhide-z.refleak/build/Lib/multiprocessing/util.py", line 300, in _run_finalizers finalizer() File "/home/dje/cpython-buildarea/3.11.edelsohn-fedora-rawhide-z.refleak/build/Lib/multiprocessing/util.py", line 224, in __call__ res = self._callback(*self._args, **self._kwargs) ^^^^^^^^^^^^^^^^^^^^^^^^^^^^^^^^^^^^^^^^^^^ File "/home/dje/cpython-buildarea/3.11.edelsohn-fedora-rawhide-z.refleak/build/Lib/multiprocessing/synchronize.py", line 87, in _cleanup sem_unlink(name) FileNotFoundError: [Errno 2] No such file or directory Traceback (most recent call last): File "/home/dje/cpython-buildarea/3.11.edelsohn-fedora-rawhide-z.refleak/build/Lib/multiprocessing/util.py", line 300, in _run_finalizers finalizer() File "/home/dje/cpython-buildarea/3.11.edelsohn-fedora-rawhide-z.refleak/build/Lib/multiprocessing/util.py", line 224, in __call__ res = self._callback(*self._args, **self._kwargs) ^^^^^^^^^^^^^^^^^^^^^^^^^^^^^^^^^^^^^^^^^^^ File "/home/dje/cpython-buildarea/3.11.edelsohn-fedora-rawhide-z.refleak/build/Lib/multiprocessing/synchronize.py", line 87, in _cleanup sem_unlink(name) FileNotFoundError: [Errno 2] No such file or directory Traceback (most recent call last): File "/home/dje/cpython-buildarea/3.11.edelsohn-fedora-rawhide-z.refleak/build/Lib/multiprocessing/util.py", line 300, in _run_finalizers finalizer() File "/home/dje/cpython-buildarea/3.11.edelsohn-fedora-rawhide-z.refleak/build/Lib/multiprocessing/util.py", line 224, in __call__ res = self._callback(*self._args, **self._kwargs) ^^^^^^^^^^^^^^^^^^^^^^^^^^^^^^^^^^^^^^^^^^^ File "/home/dje/cpython-buildarea/3.11.edelsohn-fedora-rawhide-z.refleak/build/Lib/multiprocessing/synchronize.py", line 87, in _cleanup sem_unlink(name) FileNotFoundError: [Errno 2] No such file or directory Traceback (most recent call last): File "/home/dje/cpython-buildarea/3.11.edelsohn-fedora-rawhide-z.refleak/build/Lib/multiprocessing/util.py", line 300, in _run_finalizers finalizer() File "/home/dje/cpython-buildarea/3.11.edelsohn-fedora-rawhide-z.refleak/build/Lib/multiprocessing/util.py", line 224, in __call__ res = self._callback(*self._args, **self._kwargs) ^^^^^^^^^^^^^^^^^^^^^^^^^^^^^^^^^^^^^^^^^^^ File "/home/dje/cpython-buildarea/3.11.edelsohn-fedora-rawhide-z.refleak/build/Lib/multiprocessing/synchronize.py", line 87, in _cleanup sem_unlink(name) FileNotFoundError: [Errno 2] No such file or directory Traceback (most recent call last): File "/home/dje/cpython-buildarea/3.11.edelsohn-fedora-rawhide-z.refleak/build/Lib/multiprocessing/util.py", line 300, in _run_finalizers finalizer() File "/home/dje/cpython-buildarea/3.11.edelsohn-fedora-rawhide-z.refleak/build/Lib/multiprocessing/util.py", line 224, in __call__ res = self._callback(*self._args, **self._kwargs) ^^^^^^^^^^^^^^^^^^^^^^^^^^^^^^^^^^^^^^^^^^^ File "/home/dje/cpython-buildarea/3.11.edelsohn-fedora-rawhide-z.refleak/build/Lib/multiprocessing/synchronize.py", line 87, in _cleanup sem_unlink(name) FileNotFoundError: [Errno 2] No such file or directory ./home/dje/cpython-buildarea/3.11.edelsohn-fedora-rawhide-z.refleak/build/Lib/multiprocessing/resource_tracker.py:224: UserWarning: resource_tracker: There appear to be 6 leaked semaphore objects to clean up at shutdown warnings.warn('resource_tracker: There appear to be %d ' Traceback (most recent call last): File "/home/dje/cpython-buildarea/3.11.edelsohn-fedora-rawhide-z.refleak/build/Lib/multiprocessing/util.py", line 300, in _run_finalizers finalizer() File "/home/dje/cpython-buildarea/3.11.edelsohn-fedora-rawhide-z.refleak/build/Lib/multiprocessing/util.py", line 224, in __call__ res = self._callback(*self._args, **self._kwargs) ^^^^^^^^^^^^^^^^^^^^^^^^^^^^^^^^^^^^^^^^^^^ File "/home/dje/cpython-buildarea/3.11.edelsohn-fedora-rawhide-z.refleak/build/Lib/multiprocessing/synchronize.py", line 87, in _cleanup sem_unlink(name) FileNotFoundError: [Errno 2] No such file or directory Traceback (most recent call last): File "/home/dje/cpython-buildarea/3.11.edelsohn-fedora-rawhide-z.refleak/build/Lib/multiprocessing/util.py", line 300, in _run_finalizers finalizer() File "/home/dje/cpython-buildarea/3.11.edelsohn-fedora-rawhide-z.refleak/build/Lib/multiprocessing/util.py", line 224, in __call__ res = self._callback(*self._args, **self._kwargs) ^^^^^^^^^^^^^^^^^^^^^^^^^^^^^^^^^^^^^^^^^^^ File "/home/dje/cpython-buildarea/3.11.edelsohn-fedora-rawhide-z.refleak/build/Lib/multiprocessing/synchronize.py", line 87, in _cleanup sem_unlink(name) FileNotFoundError: [Errno 2] No such file or directory Traceback (most recent call last): File "/home/dje/cpython-buildarea/3.11.edelsohn-fedora-rawhide-z.refleak/build/Lib/multiprocessing/util.py", line 300, in _run_finalizers finalizer() File "/home/dje/cpython-buildarea/3.11.edelsohn-fedora-rawhide-z.refleak/build/Lib/multiprocessing/util.py", line 224, in __call__ res = self._callback(*self._args, **self._kwargs) ^^^^^^^^^^^^^^^^^^^^^^^^^^^^^^^^^^^^^^^^^^^ File "/home/dje/cpython-buildarea/3.11.edelsohn-fedora-rawhide-z.refleak/build/Lib/multiprocessing/synchronize.py", line 87, in _cleanup sem_unlink(name) FileNotFoundError: [Errno 2] No such file or directory Traceback (most recent call last): File "/home/dje/cpython-buildarea/3.11.edelsohn-fedora-rawhide-z.refleak/build/Lib/multiprocessing/util.py", line 300, in _run_finalizers finalizer() File "/home/dje/cpython-buildarea/3.11.edelsohn-fedora-rawhide-z.refleak/build/Lib/multiprocessing/util.py", line 224, in __call__ res = self._callback(*self._args, **self._kwargs) ^^^^^^^^^^^^^^^^^^^^^^^^^^^^^^^^^^^^^^^^^^^ File "/home/dje/cpython-buildarea/3.11.edelsohn-fedora-rawhide-z.refleak/build/Lib/multiprocessing/synchronize.py", line 87, in _cleanup sem_unlink(name) FileNotFoundError: [Errno 2] No such file or directory Traceback (most recent call last): File "/home/dje/cpython-buildarea/3.11.edelsohn-fedora-rawhide-z.refleak/build/Lib/multiprocessing/util.py", line 300, in _run_finalizers finalizer() File "/home/dje/cpython-buildarea/3.11.edelsohn-fedora-rawhide-z.refleak/build/Lib/multiprocessing/util.py", line 224, in __call__ res = self._callback(*self._args, **self._kwargs) ^^^^^^^^^^^^^^^^^^^^^^^^^^^^^^^^^^^^^^^^^^^ File "/home/dje/cpython-buildarea/3.11.edelsohn-fedora-rawhide-z.refleak/build/Lib/multiprocessing/synchronize.py", line 87, in _cleanup sem_unlink(name) FileNotFoundError: [Errno 2] No such file or directory Traceback (most recent call last): File "/home/dje/cpython-buildarea/3.11.edelsohn-fedora-rawhide-z.refleak/build/Lib/multiprocessing/util.py", line 300, in _run_finalizers finalizer() File "/home/dje/cpython-buildarea/3.11.edelsohn-fedora-rawhide-z.refleak/build/Lib/multiprocessing/util.py", line 224, in __call__ res = self._callback(*self._args, **self._kwargs) ^^^^^^^^^^^^^^^^^^^^^^^^^^^^^^^^^^^^^^^^^^^ File "/home/dje/cpython-buildarea/3.11.edelsohn-fedora-rawhide-z.refleak/build/Lib/multiprocessing/synchronize.py", line 87, in _cleanup sem_unlink(name) FileNotFoundError: [Errno 2] No such file or directory .
Traceback (most recent call last): File "/home/dje/cpython-buildarea/3.11.edelsohn-fedora-rawhide-z.refleak/build/Lib/test/test_tools/test_freeze.py", line 27, in test_freeze_simple_script outdir, scriptfile, python = helper.prepare(script, outdir) ^^^^^^^^^^^^^^^^^^^^^^^^^^^^^^ File "/home/dje/cpython-buildarea/3.11.edelsohn-fedora-rawhide-z.refleak/build/Tools/freeze/test/freeze.py", line 184, in prepare _run_quiet([MAKE, '-C', builddir, 'install']) File "/home/dje/cpython-buildarea/3.11.edelsohn-fedora-rawhide-z.refleak/build/Tools/freeze/test/freeze.py", line 36, in _run_quiet print(err.stdout) OSError: [Errno 28] No space left on device
Traceback (most recent call last): File "<string>", line 1, in <module> File "/tmp/tmpo6avm4q4/cpython/Lib/sysconfig.py", line 715, in get_config_var return get_config_vars().get(name) ^^^^^^^^^^^^^^^^^ File "/tmp/tmpo6avm4q4/cpython/Lib/sysconfig.py", line 670, in get_config_vars _init_posix(_CONFIG_VARS) File "/tmp/tmpo6avm4q4/cpython/Lib/sysconfig.py", line 531, in _init_posix _temp = __import__(name, globals(), locals(), ['build_time_vars'], 0) ^^^^^^^^^^^^^^^^^^^^^^^^^^^^^^^^^^^^^^^^^^^^^^^^^^^^^^^^^^^^^ ModuleNotFoundError: No module named '_sysconfigdata_d_linux_s390x-linux-gnu'
Traceback (most recent call last): File "/home/dje/cpython-buildarea/3.11.edelsohn-fedora-rawhide-z.refleak/build/Lib/multiprocessing/resource_tracker.py", line 209, in main cache[rtype].remove(name) KeyError: '/psm_500a1235' .Traceback (most recent call last): File "/home/dje/cpython-buildarea/3.11.edelsohn-fedora-rawhide-z.refleak/build/Lib/multiprocessing/resource_tracker.py", line 209, in main cache[rtype].remove(name) KeyError: '/psm_ca55675f' .Traceback (most recent call last): File "/home/dje/cpython-buildarea/3.11.edelsohn-fedora-rawhide-z.refleak/build/Lib/multiprocessing/resource_tracker.py", line 209, in main cache[rtype].remove(name) KeyError: '/psm_65f139b3' .Traceback (most recent call last): File "/home/dje/cpython-buildarea/3.11.edelsohn-fedora-rawhide-z.refleak/build/Lib/multiprocessing/resource_tracker.py", line 209, in main cache[rtype].remove(name) KeyError: '/psm_8732ed92' .Traceback (most recent call last): File "/home/dje/cpython-buildarea/3.11.edelsohn-fedora-rawhide-z.refleak/build/Lib/multiprocessing/resource_tracker.py", line 209, in main cache[rtype].remove(name) KeyError: '/psm_b5174386' .Traceback (most recent call last): File "/home/dje/cpython-buildarea/3.11.edelsohn-fedora-rawhide-z.refleak/build/Lib/multiprocessing/resource_tracker.py", line 209, in main cache[rtype].remove(name) KeyError: '/psm_31c52fbd' .
Traceback (most recent call last): File "/home/dje/cpython-buildarea/3.11.edelsohn-fedora-rawhide-z.refleak/build/Lib/test/test_faulthandler.py", line 671, in test_dump_traceback_later_file self.check_dump_traceback_later(filename=filename) File "/home/dje/cpython-buildarea/3.11.edelsohn-fedora-rawhide-z.refleak/build/Lib/test/test_faulthandler.py", line 655, in check_dump_traceback_later self.assertRegex(trace, regex) AssertionError: Regex didn't match: '^Timeout \\(0:00:00.500000\\)!\\nThread 0x[0-9a-f]+ \\(most recent call first\\):\\n File "<string>", line 17 in func\n File "<string>", line 26 in <module>$' not found in ''
Traceback (most recent call last): File "/home/dje/cpython-buildarea/3.11.edelsohn-fedora-rawhide-z.refleak/build/Lib/multiprocessing/resource_tracker.py", line 209, in main cache[rtype].remove(name) KeyError: '/psm_41d7d246' ...Traceback (most recent call last): File "/home/dje/cpython-buildarea/3.11.edelsohn-fedora-rawhide-z.refleak/build/Lib/multiprocessing/resource_tracker.py", line 209, in main cache[rtype].remove(name) KeyError: '/psm_40060a1a' .Traceback (most recent call last): File "/home/dje/cpython-buildarea/3.11.edelsohn-fedora-rawhide-z.refleak/build/Lib/multiprocessing/resource_tracker.py", line 209, in main cache[rtype].remove(name) KeyError: '/psm_ce783b20' .Traceback (most recent call last): File "/home/dje/cpython-buildarea/3.11.edelsohn-fedora-rawhide-z.refleak/build/Lib/multiprocessing/resource_tracker.py", line 209, in main cache[rtype].remove(name) KeyError: '/psm_9dfc17da' .
Traceback (most recent call last): File "<string>", line 1, in <module> File "/tmp/tmpe19m1r2p/cpython/Lib/sysconfig.py", line 715, in get_config_var return get_config_vars().get(name) ^^^^^^^^^^^^^^^^^ File "/tmp/tmpe19m1r2p/cpython/Lib/sysconfig.py", line 670, in get_config_vars _init_posix(_CONFIG_VARS) File "/tmp/tmpe19m1r2p/cpython/Lib/sysconfig.py", line 531, in _init_posix _temp = __import__(name, globals(), locals(), ['build_time_vars'], 0) ^^^^^^^^^^^^^^^^^^^^^^^^^^^^^^^^^^^^^^^^^^^^^^^^^^^^^^^^^^^^^ ModuleNotFoundError: No module named '_sysconfigdata_d_linux_s390x-linux-gnu'
Traceback (most recent call last): File "/home/dje/cpython-buildarea/3.11.edelsohn-fedora-rawhide-z.refleak/build/Lib/test/test_tools/test_freeze.py", line 27, in test_freeze_simple_script outdir, scriptfile, python = helper.prepare(script, outdir) ^^^^^^^^^^^^^^^^^^^^^^^^^^^^^^ File "/home/dje/cpython-buildarea/3.11.edelsohn-fedora-rawhide-z.refleak/build/Tools/freeze/test/freeze.py", line 184, in prepare _run_quiet([MAKE, '-C', builddir, 'install']) File "/home/dje/cpython-buildarea/3.11.edelsohn-fedora-rawhide-z.refleak/build/Tools/freeze/test/freeze.py", line 25, in _run_quiet return subprocess.run( ^^^^^^^^^^^^^^^ File "/home/dje/cpython-buildarea/3.11.edelsohn-fedora-rawhide-z.refleak/build/Lib/subprocess.py", line 571, in run raise CalledProcessError(retcode, process.args, subprocess.CalledProcessError: Command '['/usr/bin/make', '-C', '/tmp/tmpe19m1r2p/python-build', 'install']' returned non-zero exit status 2.
Traceback (most recent call last): File "/home/dje/cpython-buildarea/3.11.edelsohn-fedora-rawhide-z.refleak/build/Tools/freeze/test/freeze.py", line 25, in _run_quiet return subprocess.run( ^^^^^^^^^^^^^^^ File "/home/dje/cpython-buildarea/3.11.edelsohn-fedora-rawhide-z.refleak/build/Lib/subprocess.py", line 571, in run raise CalledProcessError(retcode, process.args, subprocess.CalledProcessError: Command '['/usr/bin/make', '-C', '/tmp/tmpo6avm4q4/python-build', 'install']' returned non-zero exit status 2.
Test report
Failed tests:
- test_tools
Failed subtests:
- test_freeze_simple_script - test.test_tools.test_freeze.TestFreeze.test_freeze_simple_script
Sincerely, -The Buildbot
participants (1)
-
buildbot@python.org