Buildbot failure in Python on AMD64 RHEL8 LTO + PGO 3.x
The Buildbot has detected a failed build on builder AMD64 RHEL8 LTO + PGO 3.x while building python/cpython. Full details are available at: https://buildbot.python.org/all/#builders/568/builds/344
Buildbot URL: https://buildbot.python.org/all/
Worker for this Build: cstratak-RHEL8-x86_64
Build Reason: <unknown> Blamelist: Alexey Izbyshev <izbyshev@ispras.ru>, kj <28750310+Fidget-Spinner@users.noreply.github.com>
BUILD FAILED: failed test (failure)
Summary of the results of the build (if available):
== Tests result: FAILURE then FAILURE ==
409 tests OK.
10 slowest tests:
- test_peg_generator: 6 min 1 sec
- test_mailbox: 4 min 4 sec
- test_concurrent_futures: 2 min 40 sec
- test_io: 2 min 22 sec
- test_tarfile: 1 min 54 sec
- test_sqlite: 1 min 39 sec
- test_largefile: 1 min 30 sec
- test_shelve: 1 min 22 sec
- test_multiprocessing_spawn: 1 min 17 sec
- test_multiprocessing_forkserver: 1 min 2 sec
1 test failed: test_zipimport
14 tests skipped: test_devpoll test_gdb test_ioctl test_kqueue test_msilib test_ossaudiodev test_startfile test_tix test_tk test_ttk_guionly test_winconsoleio test_winreg test_winsound test_zipfile64
1 re-run test: test_zipimport
Total duration: 7 min 44 sec
Captured traceback
Traceback (most recent call last): File "/home/buildbot/buildarea/3.x.cstratak-RHEL8-x86_64.lto-pgo/build/Lib/test/test_zipimport.py", line 594, in testGetCompiledSource self.doTest(pyc_ext, files, TESTMOD, call=self.assertModuleSource) File "/home/buildbot/buildarea/3.x.cstratak-RHEL8-x86_64.lto-pgo/build/Lib/test/test_zipimport.py", line 148, in doTest self.assertEqual(file, os.path.join(TEMP_ZIP, AssertionError: '/hom[85 chars]7æ/test_python_worker_1789530æ/junk95142.zip/ziptestmodule.py' != '/hom[85 chars]7æ/test_python_worker_1789530æ/junk95142.zip/ziptestmodule.pyc'
- /home/buildbot/buildarea/3.x.cstratak-RHEL8-x86_64.lto-pgo/build/build/test_python_1785767æ/test_python_worker_1789530æ/junk95142.zip/ziptestmodule.py
- /home/buildbot/buildarea/3.x.cstratak-RHEL8-x86_64.lto-pgo/build/build/test_python_1785767æ/test_python_worker_1789530æ/junk95142.zip/ziptestmodule.pyc ? +
Traceback (test.test_zipimport.CompressedZipImportTestCase) ... ok
Traceback (most recent call last): File "/home/buildbot/buildarea/3.x.cstratak-RHEL8-x86_64.lto-pgo/build/Lib/test/test_zipimport.py", line 594, in testGetCompiledSource self.doTest(pyc_ext, files, TESTMOD, call=self.assertModuleSource) File "/home/buildbot/buildarea/3.x.cstratak-RHEL8-x86_64.lto-pgo/build/Lib/test/test_zipimport.py", line 148, in doTest self.assertEqual(file, os.path.join(TEMP_ZIP, AssertionError: '/hom[57 chars]ild/build/test_python_1785767æ/junk95142.zip/ziptestmodule.py' != '/hom[57 chars]ild/build/test_python_1785767æ/junk95142.zip/ziptestmodule.pyc'
- /home/buildbot/buildarea/3.x.cstratak-RHEL8-x86_64.lto-pgo/build/build/test_python_1785767æ/junk95142.zip/ziptestmodule.py
- /home/buildbot/buildarea/3.x.cstratak-RHEL8-x86_64.lto-pgo/build/build/test_python_1785767æ/junk95142.zip/ziptestmodule.pyc ? +
Traceback (most recent call last): File "/home/buildbot/buildarea/3.x.cstratak-RHEL8-x86_64.lto-pgo/build/Lib/test/test_zipimport.py", line 194, in testBoth self.doTest(pyc_ext, files, TESTMOD) File "/home/buildbot/buildarea/3.x.cstratak-RHEL8-x86_64.lto-pgo/build/Lib/test/test_zipimport.py", line 148, in doTest self.assertEqual(file, os.path.join(TEMP_ZIP, AssertionError: '/hom[85 chars]7æ/test_python_worker_1789530æ/junk95142.zip/ziptestmodule.py' != '/hom[85 chars]7æ/test_python_worker_1789530æ/junk95142.zip/ziptestmodule.pyc'
- /home/buildbot/buildarea/3.x.cstratak-RHEL8-x86_64.lto-pgo/build/build/test_python_1785767æ/test_python_worker_1789530æ/junk95142.zip/ziptestmodule.py
- /home/buildbot/buildarea/3.x.cstratak-RHEL8-x86_64.lto-pgo/build/build/test_python_1785767æ/test_python_worker_1789530æ/junk95142.zip/ziptestmodule.pyc ? +
Traceback (most recent call last): File "/home/buildbot/buildarea/3.x.cstratak-RHEL8-x86_64.lto-pgo/build/Lib/test/test_zipimport.py", line 194, in testBoth self.doTest(pyc_ext, files, TESTMOD) File "/home/buildbot/buildarea/3.x.cstratak-RHEL8-x86_64.lto-pgo/build/Lib/test/test_zipimport.py", line 148, in doTest self.assertEqual(file, os.path.join(TEMP_ZIP, AssertionError: '/hom[57 chars]ild/build/test_python_1785767æ/junk95142.zip/ziptestmodule.py' != '/hom[57 chars]ild/build/test_python_1785767æ/junk95142.zip/ziptestmodule.pyc'
- /home/buildbot/buildarea/3.x.cstratak-RHEL8-x86_64.lto-pgo/build/build/test_python_1785767æ/junk95142.zip/ziptestmodule.py
- /home/buildbot/buildarea/3.x.cstratak-RHEL8-x86_64.lto-pgo/build/build/test_python_1785767æ/junk95142.zip/ziptestmodule.pyc ? +
Traceback (test.test_zipimport.UncompressedZipImportTestCase) ... ok
Test report
Failed tests:
- test_zipimport
Failed subtests:
- testBoth - test.test_zipimport.UncompressedZipImportTestCase
- testGetCompiledSource - test.test_zipimport.UncompressedZipImportTestCase
- testBoth - test.test_zipimport.CompressedZipImportTestCase
- testGetCompiledSource - test.test_zipimport.CompressedZipImportTestCase
Sincerely, -The Buildbot
participants (1)
-
buildbot@python.org