☠ Buildbot (Python): python/cpython - failed test (failure) (main)
The Buildbot has detected a new failure on builder PPC64LE RHEL7 LTO 3.x while building python/cpython. Full details are available at: https://buildbot.python.org/all/#/builders/503/builds/3741
Buildbot URL: https://buildbot.python.org/all/
Worker for this Build: cstratak-RHEL7-ppc64le
Build Reason: <unknown> Blamelist: Eric Snow <ericsnowcurrently@gmail.com>, Erlend E. Aasland <erlend@python.org>, Gertjan van Zwieten <git@gjvz.nl>, Nikita Sobolev <mail@sobolevn.me>, Serhiy Storchaka <storchaka@gmail.com>
BUILD FAILED: failed test (failure)
Summary of the results of the build (if available):
== Tests result: ENV CHANGED ==
423 tests OK.
10 slowest tests:
- test_math: 3 min 28 sec
- test_concurrent_futures: 2 min 42 sec
- test_multiprocessing_spawn: 2 min 32 sec
- test_hashlib: 2 min 7 sec
- test_multiprocessing_forkserver: 1 min 39 sec
- test_multiprocessing_fork: 1 min 18 sec
- test_tokenize: 1 min 16 sec
- test_unparse: 1 min 11 sec
- test_capi: 1 min 1 sec
- test_signal: 50.7 sec
1 test altered the execution environment: test.test_asyncio.test_subprocess
23 tests skipped: test.test_asyncio.test_windows_events test.test_asyncio.test_windows_utils test_devpoll test_gdb test_idle test_ioctl test_kqueue test_launcher test_perf_profiler test_smtpnet test_sqlite3 test_ssl test_startfile test_tcl test_tkinter test_ttk test_ttk_textonly test_turtle test_winconsoleio test_winreg test_winsound test_wmi test_zipfile64
Total duration: 6 min 36 sec
Captured traceback
remote: Enumerating objects: 26, done.
remote: Counting objects: 3% (1/26)
remote: Counting objects: 7% (2/26)
remote: Counting objects: 11% (3/26)
remote: Counting objects: 15% (4/26)
remote: Counting objects: 19% (5/26)
remote: Counting objects: 23% (6/26)
remote: Counting objects: 26% (7/26)
remote: Counting objects: 30% (8/26)
remote: Counting objects: 34% (9/26)
remote: Counting objects: 38% (10/26)
remote: Counting objects: 42% (11/26)
remote: Counting objects: 46% (12/26)
remote: Counting objects: 50% (13/26)
remote: Counting objects: 53% (14/26)
remote: Counting objects: 57% (15/26)
remote: Counting objects: 61% (16/26)
remote: Counting objects: 65% (17/26)
remote: Counting objects: 69% (18/26)
remote: Counting objects: 73% (19/26)
remote: Counting objects: 76% (20/26)
remote: Counting objects: 80% (21/26)
remote: Counting objects: 84% (22/26)
remote: Counting objects: 88% (23/26)
remote: Counting objects: 92% (24/26)
remote: Counting objects: 96% (25/26)
remote: Counting objects: 100% (26/26)
remote: Counting objects: 100% (26/26), done.
remote: Compressing objects: 11% (1/9)
remote: Compressing objects: 22% (2/9)
remote: Compressing objects: 33% (3/9)
remote: Compressing objects: 44% (4/9)
remote: Compressing objects: 55% (5/9)
remote: Compressing objects: 66% (6/9)
remote: Compressing objects: 77% (7/9)
remote: Compressing objects: 88% (8/9)
remote: Compressing objects: 100% (9/9)
remote: Compressing objects: 100% (9/9), done.
remote: Total 26 (delta 17), reused 22 (delta 17), pack-reused 0
From https://github.com/python/cpython
- branch main -> FETCH_HEAD Note: checking out '707018cc75558d6695e9e199a3ed0c8a4ff7cbcc'.
You are in 'detached HEAD' state. You can look around, make experimental changes and commit them, and you can discard any commits you make in this state without impacting any branches by performing another checkout.
If you want to create a new branch to retain commits you create, you may do so (now or later) by using -b with the checkout command again. Example:
git checkout -b new_branch_name
HEAD is now at 707018c... gh-107630: Fix Remaining Subinterpreters Crashes on Py_TRACE_REFS Builds (gh-107750) Switched to and reset branch 'main'
make: *** [Makefile:2013: buildbottest] Error 3
Test report
Sincerely, -The BuildbotThe Buildbot has detected a new failure on builder s390x RHEL8 LTO + PGO 3.x while building python/cpython. Full details are available at: https://buildbot.python.org/all/#/builders/442/builds/4733
Buildbot URL: https://buildbot.python.org/all/
Worker for this Build: edelsohn-rhel8-z
Build Reason: <unknown> Blamelist: Adam Turner <9087854+AA-Turner@users.noreply.github.com>, Alex Waygood <Alex.Waygood@Gmail.com>, Alexandru Mărășteanu <alexei@users.noreply.github.com>, Anders Kaseorg <andersk@mit.edu>, Barney Gale <barney.gale@gmail.com>, Brandt Bucher <brandtbucher@microsoft.com>, Charlie Zhao <zhaoyu_hit@qq.com>, Christopher Chavez <chrischavez@gmx.us>, Daniele Procida <daniele@vurt.org>, Dong-hee Na <donghee.na@python.org>, Eric Snow <ericsnowcurrently@gmail.com>, Erlend E. Aasland <erlend@python.org>, Felipe A. Hernandez <ergoithz@gmail.com>, Furkan Onder <furkanonder@protonmail.com>, Georg Brandl <georg@python.org>, Gertjan van Zwieten <git@gjvz.nl>, Guido van Rossum <guido@python.org>, Hugo van Kemenade <hugovk@users.noreply.github.com>, Illia Volochii <illia.volochii@gmail.com>, Inada Naoki <songofacandy@gmail.com>, Irit Katriel <1055913+iritkatriel@users.noreply.github.com>, Ivin Lee <62840497+rdrf2838@users.noreply.github.com>, Jacob Walls <jacobtylerwalls@gmail.com>, James C ave <jcave137@gmail.com>, James Hilton-Balfe <gobot1234yt@gmail.com>, János Kukovecz <kukoveczjanos@gmail.com>, Kamil Turek <kamil.turek@hotmail.com>, Konstantin <kpp.live+github@gmail.com>, Kumar Aditya <kumaraditya@python.org>, Mark Shannon <mark@hotpy.org>, Michael The <michael-the1@users.noreply.github.com>, Ned Deily <nad@python.org>, Nikita Sobolev <mail@sobolevn.me>, Pablo Galindo Salgado <Pablogsal@gmail.com>, Pieter Eendebak <pieter.eendebak@gmail.com>, Rakesh Sabale <102187286+ghubrakesh@users.noreply.github.com>, Serhiy Storchaka <storchaka@gmail.com>, Terry Jan Reedy <tjreedy@udel.edu>, Tian Gao <gaogaotiantian@hotmail.com>, Tom Niget <zippedfire@free.fr>, Tomas R <tomas.roun8@gmail.com>, Victor Stinner <vstinner@python.org>, cocoatomo <cocoatomo77@gmail.com>, da-woods <dw-git@d-woods.co.uk>, justdan6 <134341009+justdan6@users.noreply.github.com>, opavliuk <40970635+opavlyuk@users.noreply.github.com>, shailshouryya <42100758+shailshouryya@users.noreply.github.com>
BUILD FAILED: failed test (failure) uploading test-results.xml (failure)
Summary of the results of the build (if available):
==
Captured traceback
Note: switching to '707018cc75558d6695e9e199a3ed0c8a4ff7cbcc'.
You are in 'detached HEAD' state. You can look around, make experimental changes and commit them, and you can discard any commits you make in this state without impacting any branches by switching back to a branch.
If you want to create a new branch to retain commits you create, you may do so (now or later) by using -c with the switch command. Example:
git switch -c <new-branch-name>
Or undo this operation with:
git switch -
Turn off this advice by setting config variable advice.detachedHead to false
HEAD is now at 707018cc75 gh-107630: Fix Remaining Subinterpreters Crashes on Py_TRACE_REFS Builds (gh-107750) Switched to and reset branch 'main'
find: ‘build’: No such file or directory find: ‘build’: No such file or directory find: ‘build’: No such file or directory find: ‘build’: No such file or directory make[2]: [Makefile:2794: clean-retain-profile] Error 1 (ignored) ./Modules/_decimal/libmpdec/context.c:57: warning: mpd_setminalloc: ignoring request to set MPD_MINALLOC a second time
./Modules/_decimal/libmpdec/context.c:57: warning: mpd_setminalloc: ignoring request to set MPD_MINALLOC a second time
Timeout (0:15:00)! Thread 0x000003ff7f1f7730 (most recent call first): File "/home/dje/cpython-buildarea/3.x.edelsohn-rhel8-z.lto-pgo/build/Lib/selectors.py", line 398 in select File "/home/dje/cpython-buildarea/3.x.edelsohn-rhel8-z.lto-pgo/build/Lib/subprocess.py", line 2108 in _communicate File "/home/dje/cpython-buildarea/3.x.edelsohn-rhel8-z.lto-pgo/build/Lib/subprocess.py", line 1209 in communicate File "/home/dje/cpython-buildarea/3.x.edelsohn-rhel8-z.lto-pgo/build/Lib/subprocess.py", line 550 in run File "/home/dje/cpython-buildarea/3.x.edelsohn-rhel8-z.lto-pgo/build/Tools/freeze/test/freeze.py", line 25 in _run_quiet File "/home/dje/cpython-buildarea/3.x.edelsohn-rhel8-z.lto-pgo/build/Tools/freeze/test/freeze.py", line 198 in freeze File "/home/dje/cpython-buildarea/3.x.edelsohn-rhel8-z.lto-pgo/build/Lib/test/test_tools/test_freeze.py", line 28 in test_freeze_simple_script File "/home/dje/cpython-buildarea/3.x.edelsohn-rhel8-z.lto-pgo/build/Lib/unittest/case.py", line 589 in _callTestMethod File "/home/dje/cpython-buildarea/3.x.edelsohn-rhel8-z.lto-pgo/build/Lib/unittest/case.py", line 634 in run File "/home/dje/cpython-buildarea/3.x.edelsohn-rhel8-z.lto-pgo/build/Lib/unittest/case.py", line 690 in __call__ File "/home/dje/cpython-buildarea/3.x.edelsohn-rhel8-z.lto-pgo/build/Lib/unittest/suite.py", line 122 in run File "/home/dje/cpython-buildarea/3.x.edelsohn-rhel8-z.lto-pgo/build/Lib/unittest/suite.py", line 84 in __call__ File "/home/dje/cpython-buildarea/3.x.edelsohn-rhel8-z.lto-pgo/build/Lib/unittest/suite.py", line 122 in run File "/home/dje/cpython-buildarea/3.x.edelsohn-rhel8-z.lto-pgo/build/Lib/unittest/suite.py", line 84 in __call__ File "/home/dje/cpython-buildarea/3.x.edelsohn-rhel8-z.lto-pgo/build/Lib/unittest/suite.py", line 122 in run File "/home/dje/cpython-buildarea/3.x.edelsohn-rhel8-z.lto-pgo/build/Lib/unittest/suite.py", line 84 in __call__ File "/home/dje/cpython-buildarea/3.x.edelsohn-rhel8-z.lto-pgo/build/Lib/unittest/suite.py", line 122 in run File "/home/dje/cpython-buildarea/3.x.edelsohn-rhel8-z.lto-pgo/build/Lib/unittest/suite.py", line 84 in __call__ File "/home/dje/cpython-buildarea/3.x.edelsohn-rhel8-z.lto-pgo/build/Lib/unittest/suite.py", line 122 in run File "/home/dje/cpython-buildarea/3.x.edelsohn-rhel8-z.lto-pgo/build/Lib/unittest/suite.py", line 84 in __call__ File "/home/dje/cpython-buildarea/3.x.edelsohn-rhel8-z.lto-pgo/build/Lib/unittest/runner.py", line 240 in run File "/home/dje/cpython-buildarea/3.x.edelsohn-rhel8-z.lto-pgo/build/Lib/test/support/__init__.py", line 1116 in _run_suite File "/home/dje/cpython-buildarea/3.x.edelsohn-rhel8-z.lto-pgo/build/Lib/test/support/__init__.py", line 1242 in run_unittest File "/home/dje/cpython-buildarea/3.x.edelsohn-rhel8-z.lto-pgo/build/Lib/test/libregrtest/runtest.py", line 294 in _test_module File "/home/dje/cpython-buildarea/3.x.edelsohn-rhel8-z.lto-pgo/build/Lib/test/libregrtest/runtest.py", line 330 in _runtest_inner2 File "/home/dje/cpython-buildarea/3.x.edelsohn-rhel8-z.lto-pgo/build/Lib/test/libregrtest/runtest.py", line 373 in _runtest_inner File "/home/dje/cpython-buildarea/3.x.edelsohn-rhel8-z.lto-pgo/build/Lib/test/libregrtest/runtest.py", line 248 in _runtest File "/home/dje/cpython-buildarea/3.x.edelsohn-rhel8-z.lto-pgo/build/Lib/test/libregrtest/runtest.py", line 278 in runtest File "/home/dje/cpython-buildarea/3.x.edelsohn-rhel8-z.lto-pgo/build/Lib/test/libregrtest/main.py", line 365 in rerun_failed_tests File "/home/dje/cpython-buildarea/3.x.edelsohn-rhel8-z.lto-pgo/build/Lib/test/libregrtest/main.py", line 803 in _main File "/home/dje/cpython-buildarea/3.x.edelsohn-rhel8-z.lto-pgo/build/Lib/test/libregrtest/main.py", line 758 in main File "/home/dje/cpython-buildarea/3.x.edelsohn-rhel8-z.lto-pgo/build/Lib/test/libregrtest/main.py", line 822 in main File "/home/dje/cpython-buildarea/3.x.edelsohn-rhel8-z.lto-pgo/build/Lib/test/__main__.py", line 2 in <module> File "<frozen runpy>", line 88 in _run_code File "<frozen runpy>", line 198 in _run_module_as_main make: *** [Makefile:2021: buildbottest] Error 1
Cannot open file '/home/dje/cpython-buildarea/3.x.edelsohn-rhel8-z.lto-pgo/build/test-results.xml' for upload
Test report
Failed tests:
- test_tools
Sincerely, -The Buildbot
participants (1)
-
buildbot@python.org