Re: 2.1b3 make install problems
Hello,
I have the same problem (and have had with version 2.1b2 also) and the same OS as ljacobs:
I have been running 2.0.8 and decided to try 2.1 on a RedHat 7.2 system with python 2.2.1.
Make install quits with the following error:
Traceback (most recent call last): File "bin/update", line 44, in ? import paths ImportError: No module named paths make: *** [update] Error 1
What should I try next?
Any solution?
Thanks. Denis
Denis Beauchemin, analyste Université de Sherbrooke, S.T.I. T: 819.821.8000x2252 F: 819.821.8045
Hello Denis,
Monday, August 12, 2002, 5:11:54 PM, you wrote:
Traceback (most recent call last): File "bin/update", line 44, in ? import paths ImportError: No module named paths make: *** [update] Error 1
What should I try next?
DB> Any solution?
I may be wrong (and probably I will), but I think I got the same error when I copied the config.cache file from a previous release.
Try to unpack the tarball in an empty dir and configure and make a new version.
-- Best regards, Luigi mailto:lrosa@mail.hypertrek.info
Hi Luigi,
It is what I did both times and I got the error message.
Any other clues?
Thanks!
Denis On Mon, 2002-08-12 at 11:54, Luigi Rosa wrote:
Hello Denis,
Monday, August 12, 2002, 5:11:54 PM, you wrote:
Traceback (most recent call last): File "bin/update", line 44, in ? import paths ImportError: No module named paths make: *** [update] Error 1
What should I try next?
DB> Any solution?
I may be wrong (and probably I will), but I think I got the same error when I copied the config.cache file from a previous release.
Try to unpack the tarball in an empty dir and configure and make a new version.
-- Best regards, Luigi mailto:lrosa@mail.hypertrek.info
Mailman-Developers mailing list Mailman-Developers@python.org http://mail.python.org/mailman-21/listinfo/mailman-developers
-- Denis Beauchemin, analyste Université de Sherbrooke, S.T.I. T: 819.821.8000x2252 F: 819.821.8045
"DB" == Denis Beauchemin <Denis.Beauchemin@USherbrooke.ca> writes:
DB> I have the same problem (and have had with version 2.1b2 also)
DB> and the same OS as ljacobs:
Oh, one thing you could try to help narrow this down:
cd to your $prefix directory
run "python -v bin/update"
This will output lots of information about what Python's trying to import. Hopefully the verbose output will give us a clue as to what's failing.
If it does, please send the output to me and I'll see if it makes sense
Thanks, -Barry
participants (3)
-
barry@python.org -
Denis Beauchemin -
Luigi Rosa