Python-checkins
Threads by month
- ----- 2026 -----
- October
- September
- August
- July
- June
- May
- April
- March
- February
- January
- ----- 2025 -----
- December
- November
- October
- September
- August
- July
- June
- May
- April
- March
- February
- January
- ----- 2024 -----
- December
- November
- October
- September
- August
- July
- June
- May
- April
- March
- February
- January
- ----- 2023 -----
- December
- November
- October
- September
- August
- July
- June
- May
- April
- March
- February
- January
- ----- 2022 -----
- December
- November
- October
- September
- August
- July
- June
- May
- April
- March
- February
- January
- ----- 2021 -----
- December
- November
- October
- September
- August
- July
- June
- May
- April
- March
- February
- January
- ----- 2020 -----
- December
- November
- October
- September
- August
- July
- June
- May
- April
- March
- February
- January
- ----- 2019 -----
- December
- November
- October
- September
- August
- July
- June
- May
- April
- March
- February
- January
- ----- 2018 -----
- December
- November
- October
- September
- August
- July
- June
- May
- April
- March
- February
- January
- ----- 2017 -----
- December
- November
- October
- September
- August
- July
- June
- May
- April
- March
- February
- January
- ----- 2016 -----
- December
- November
- October
- September
- August
- July
- June
- May
- April
- March
- February
- January
- ----- 2015 -----
- December
- November
- October
- September
- August
- July
- June
- May
- April
- March
- February
- January
- ----- 2014 -----
- December
- November
- October
- September
- August
- July
- June
- May
- April
- March
- February
- January
- ----- 2013 -----
- December
- November
- October
- September
- August
- July
- June
- May
- April
- March
- February
- January
- ----- 2012 -----
- December
- November
- October
- September
- August
- July
- June
- May
- April
- March
- February
- January
- ----- 2011 -----
- December
- November
- October
- September
- August
- July
- June
- May
- April
- March
- February
- January
- ----- 2010 -----
- December
- November
- October
- September
- August
- July
- June
- May
- April
- March
- February
- January
- ----- 2009 -----
- December
- November
- October
- September
- August
- July
- June
- May
- April
- March
- February
- January
- ----- 2008 -----
- December
- November
- October
- September
- August
- July
- June
- May
- April
- March
- February
- January
- ----- 2007 -----
- December
- November
- October
- September
- August
- July
- June
- May
- April
- March
- February
- January
- ----- 2006 -----
- December
- November
- October
- September
- August
- July
- June
- May
- April
- March
- February
- January
- ----- 2005 -----
- December
- November
- October
- September
- August
- July
- June
- May
- April
- March
- February
- January
- ----- 2004 -----
- December
- November
- October
- September
- August
- July
- June
- May
- April
- March
- February
- January
- ----- 2003 -----
- December
- November
- October
- September
- August
October 2007
- 8 participants
- 485 discussions
test_grammar
test_opcodes
test_dict
test_builtin
test_exceptions
test_types
test_unittest
test_doctest
test_doctest2
test_MimeWriter
test_StringIO
test___all__
test___future__
test__locale
test_abc
test_aepack
test_aepack skipped -- No module named aepack
test_al
test_al skipped -- No module named al
test_anydbm
test_applesingle
test_applesingle skipped -- No module named macostools
test_array
test_ast
test_asynchat
WARNING: failed to listen on port 54322, trying another
WARNING: failed to listen on port 9907, trying another
WARNING: failed to listen on port 10243, trying another
WARNING: failed to listen on port 32999, trying another
Exception in thread Thread-8:
Traceback (most recent call last):
File "/tmp/python-test/local/lib/python2.6/threading.py", line 486, in __bootstrap_inner
self.run()
File "/tmp/python-test/local/lib/python2.6/test/test_asynchat.py", line 22, in run
PORT = test_support.bind_port(sock, HOST, PORT)
File "/tmp/python-test/local/lib/python2.6/test/test_support.py", line 113, in bind_port
raise TestFailed('unable to find port to listen on')
TestFailed: unable to find port to listen on
WARNING: failed to listen on port 54322, trying another
WARNING: failed to listen on port 9907, trying another
WARNING: failed to listen on port 10243, trying another
WARNING: failed to listen on port 32999, trying another
Exception in thread Thread-10:
Traceback (most recent call last):
File "/tmp/python-test/local/lib/python2.6/threading.py", line 486, in __bootstrap_inner
self.run()
File "/tmp/python-test/local/lib/python2.6/test/test_asynchat.py", line 22, in run
PORT = test_support.bind_port(sock, HOST, PORT)
File "/tmp/python-test/local/lib/python2.6/test/test_support.py", line 113, in bind_port
raise TestFailed('unable to find port to listen on')
TestFailed: unable to find port to listen on
WARNING: failed to listen on port 54322, trying another
WARNING: failed to listen on port 9907, trying another
WARNING: failed to listen on port 10243, trying another
WARNING: failed to listen on port 32999, trying another
Exception in thread Thread-12:
Traceback (most recent call last):
File "/tmp/python-test/local/lib/python2.6/threading.py", line 486, in __bootstrap_inner
self.run()
File "/tmp/python-test/local/lib/python2.6/test/test_asynchat.py", line 22, in run
PORT = test_support.bind_port(sock, HOST, PORT)
File "/tmp/python-test/local/lib/python2.6/test/test_support.py", line 113, in bind_port
raise TestFailed('unable to find port to listen on')
TestFailed: unable to find port to listen on
WARNING: failed to listen on port 54322, trying another
WARNING: failed to listen on port 9907, trying another
WARNING: failed to listen on port 10243, trying another
WARNING: failed to listen on port 32999, trying another
Exception in thread Thread-14:
Traceback (most recent call last):
File "/tmp/python-test/local/lib/python2.6/threading.py", line 486, in __bootstrap_inner
self.run()
File "/tmp/python-test/local/lib/python2.6/test/test_asynchat.py", line 22, in run
PORT = test_support.bind_port(sock, HOST, PORT)
File "/tmp/python-test/local/lib/python2.6/test/test_support.py", line 113, in bind_port
raise TestFailed('unable to find port to listen on')
TestFailed: unable to find port to listen on
WARNING: failed to listen on port 54322, trying another
WARNING: failed to listen on port 9907, trying another
WARNING: failed to listen on port 10243, trying another
WARNING: failed to listen on port 32999, trying another
Exception in thread Thread-16:
Traceback (most recent call last):
File "/tmp/python-test/local/lib/python2.6/threading.py", line 486, in __bootstrap_inner
self.run()
File "/tmp/python-test/local/lib/python2.6/test/test_asynchat.py", line 22, in run
PORT = test_support.bind_port(sock, HOST, PORT)
File "/tmp/python-test/local/lib/python2.6/test/test_support.py", line 113, in bind_port
raise TestFailed('unable to find port to listen on')
TestFailed: unable to find port to listen on
WARNING: failed to listen on port 54322, trying another
WARNING: failed to listen on port 9907, trying another
WARNING: failed to listen on port 10243, trying another
WARNING: failed to listen on port 32999, trying another
Exception in thread Thread-18:
Traceback (most recent call last):
File "/tmp/python-test/local/lib/python2.6/threading.py", line 486, in __bootstrap_inner
self.run()
File "/tmp/python-test/local/lib/python2.6/test/test_asynchat.py", line 22, in run
PORT = test_support.bind_port(sock, HOST, PORT)
File "/tmp/python-test/local/lib/python2.6/test/test_support.py", line 113, in bind_port
raise TestFailed('unable to find port to listen on')
TestFailed: unable to find port to listen on
WARNING: failed to listen on port 54322, trying another
WARNING: failed to listen on port 9907, trying another
WARNING: failed to listen on port 10243, trying another
WARNING: failed to listen on port 32999, trying another
Exception in thread Thread-20:
Traceback (most recent call last):
File "/tmp/python-test/local/lib/python2.6/threading.py", line 486, in __bootstrap_inner
self.run()
File "/tmp/python-test/local/lib/python2.6/test/test_asynchat.py", line 22, in run
PORT = test_support.bind_port(sock, HOST, PORT)
File "/tmp/python-test/local/lib/python2.6/test/test_support.py", line 113, in bind_port
raise TestFailed('unable to find port to listen on')
TestFailed: unable to find port to listen on
WARNING: failed to listen on port 54322, trying another
WARNING: failed to listen on port 9907, trying another
WARNING: failed to listen on port 10243, trying another
WARNING: failed to listen on port 32999, trying another
Exception in thread Thread-22:
Traceback (most recent call last):
File "/tmp/python-test/local/lib/python2.6/threading.py", line 486, in __bootstrap_inner
self.run()
File "/tmp/python-test/local/lib/python2.6/test/test_asynchat.py", line 22, in run
PORT = test_support.bind_port(sock, HOST, PORT)
File "/tmp/python-test/local/lib/python2.6/test/test_support.py", line 113, in bind_port
raise TestFailed('unable to find port to listen on')
TestFailed: unable to find port to listen on
WARNING: failed to listen on port 54322, trying another
WARNING: failed to listen on port 9907, trying another
WARNING: failed to listen on port 10243, trying another
WARNING: failed to listen on port 32999, trying another
Exception in thread Thread-24:
Traceback (most recent call last):
File "/tmp/python-test/local/lib/python2.6/threading.py", line 486, in __bootstrap_inner
self.run()
File "/tmp/python-test/local/lib/python2.6/test/test_asynchat.py", line 22, in run
PORT = test_support.bind_port(sock, HOST, PORT)
File "/tmp/python-test/local/lib/python2.6/test/test_support.py", line 113, in bind_port
raise TestFailed('unable to find port to listen on')
TestFailed: unable to find port to listen on
test test_asynchat failed -- errors occurred; run in verbose mode for details
test_asyncore
test_atexit
test_audioop
test_augassign
test_base64
test_bastion
test_bigaddrspace
test_bigmem
test_binascii
test_binhex
test_binop
test_bisect
test_bool
test_bsddb
test_bsddb185
test_bsddb185 skipped -- No module named bsddb185
test_bsddb3
/tmp/python-test/local/lib/python2.6/bsddb/test/test_1413192.py:32: RuntimeWarning: DBTxn aborted in destructor. No prior commit() or abort().
del self.the_txn
Exception in thread reader 1:
Traceback (most recent call last):
File "/tmp/python-test/local/lib/python2.6/threading.py", line 486, in __bootstrap_inner
self.run()
File "/tmp/python-test/local/lib/python2.6/threading.py", line 446, in run
self.__target(*self.__args, **self.__kwargs)
File "/tmp/python-test/local/lib/python2.6/bsddb/test/test_thread.py", line 281, in readerThread
rec = dbutils.DeadlockWrap(c.next, max_retries=10)
File "/tmp/python-test/local/lib/python2.6/bsddb/dbutils.py", line 62, in DeadlockWrap
return function(*_args, **_kwargs)
DBLockDeadlockError: (-30996, 'DB_LOCK_DEADLOCK: Locker killed to resolve a deadlock')
Exception in thread reader 4:
Traceback (most recent call last):
File "/tmp/python-test/local/lib/python2.6/threading.py", line 486, in __bootstrap_inner
self.run()
File "/tmp/python-test/local/lib/python2.6/threading.py", line 446, in run
self.__target(*self.__args, **self.__kwargs)
File "/tmp/python-test/local/lib/python2.6/bsddb/test/test_thread.py", line 281, in readerThread
rec = dbutils.DeadlockWrap(c.next, max_retries=10)
File "/tmp/python-test/local/lib/python2.6/bsddb/dbutils.py", line 62, in DeadlockWrap
return function(*_args, **_kwargs)
DBLockDeadlockError: (-30996, 'DB_LOCK_DEADLOCK: Locker killed to resolve a deadlock')
Exception in thread reader 2:
Traceback (most recent call last):
File "/tmp/python-test/local/lib/python2.6/threading.py", line 486, in __bootstrap_inner
self.run()
File "/tmp/python-test/local/lib/python2.6/threading.py", line 446, in run
self.__target(*self.__args, **self.__kwargs)
File "/tmp/python-test/local/lib/python2.6/bsddb/test/test_thread.py", line 281, in readerThread
rec = dbutils.DeadlockWrap(c.next, max_retries=10)
File "/tmp/python-test/local/lib/python2.6/bsddb/dbutils.py", line 62, in DeadlockWrap
return function(*_args, **_kwargs)
DBLockDeadlockError: (-30996, 'DB_LOCK_DEADLOCK: Locker killed to resolve a deadlock')
Exception in thread reader 3:
Traceback (most recent call last):
File "/tmp/python-test/local/lib/python2.6/threading.py", line 486, in __bootstrap_inner
self.run()
File "/tmp/python-test/local/lib/python2.6/threading.py", line 446, in run
self.__target(*self.__args, **self.__kwargs)
File "/tmp/python-test/local/lib/python2.6/bsddb/test/test_thread.py", line 281, in readerThread
rec = dbutils.DeadlockWrap(c.next, max_retries=10)
File "/tmp/python-test/local/lib/python2.6/bsddb/dbutils.py", line 62, in DeadlockWrap
return function(*_args, **_kwargs)
DBLockDeadlockError: (-30996, 'DB_LOCK_DEADLOCK: Locker killed to resolve a deadlock')
test_buffer
test_bufio
test_bz2
test_cProfile
test_calendar
test_call
test_capi
test_cd
test_cd skipped -- No module named cd
test_cfgparser
test_cgi
test_charmapcodec
test_cl
test_cl skipped -- No module named cl
test_class
test_cmath
test_cmd_line
test_code
test_codeccallbacks
test_codecencodings_cn
test_codecencodings_hk
test_codecencodings_jp
test_codecencodings_kr
test_codecencodings_tw
test_codecmaps_cn
test_codecmaps_hk
test_codecmaps_jp
test_codecmaps_kr
test_codecmaps_tw
test_codecs
test_codeop
test_coding
test_coercion
test_collections
test_colorsys
test_commands
test_compare
test_compile
test_compiler
testCompileLibrary still working, be patient...
test_complex
test_complex_args
test_contains
test_contextlib
test_cookie
test_cookielib
test_copy
test_copy_reg
test_cpickle
test_crypt
test_csv
test_ctypes
test_datetime
test_dbm
test_decimal
test_decorators
test_defaultdict
test_deque
test_descr
test_descrtut
test_difflib
test_dircache
test_dis
test_distutils
test_dl
test_dumbdbm
test_dummy_thread
test_dummy_threading
test_email
test_email_codecs
test_email_renamed
test_enumerate
test_eof
test_errno
test_exception_variations
test_extcall
test_fcntl
test_file
test_filecmp
test_fileinput
test_float
test_fnmatch
test_fork1
test_format
test_fpformat
test_frozen
test_ftplib
test_funcattrs
test_functools
test_future
test_gc
test_gdbm
test_generators
test_genericpath
test_genexps
test_getargs
test_getargs2
test_getopt
test_gettext
test_gl
test_gl skipped -- No module named gl
test_glob
test_global
test_grp
test_gzip
test_hash
test_hashlib
test_heapq
test_hexoct
test_hmac
test_hotshot
test_htmllib
test_htmlparser
test_httplib
test_imageop
test_imageop skipped -- No module named imgfile
test_imaplib
test_imgfile
test_imgfile skipped -- No module named imgfile
test_imp
test_import
test_importhooks
test_index
test_inspect
test_ioctl
test_ioctl skipped -- Unable to open /dev/tty
test_isinstance
test_iter
test_iterlen
test_itertools
test_largefile
test_list
test_locale
test_logging
test_long
test_long_future
test_longexp
test_macostools
test_macostools skipped -- No module named macostools
test_macpath
test_mailbox
test_marshal
test_math
test_md5
test_mhlib
test_mimetools
test_mimetypes
test_minidom
test_mmap
test_module
test_modulefinder
test_multibytecodec
test_multibytecodec_support
test_multifile
test_mutants
test_netrc
test_new
test_nis
test_normalization
test_ntpath
test_old_mailbox
test_openpty
test_operator
test_optparse
test_os
test_parser
test_peepholer
test_pep247
test_pep263
test_pep277
test_pep277 skipped -- test works only on NT+
test_pep292
test_pep352
test_pickle
test_pickletools
test_pipes
test_pkg
test_pkgimport
test_platform
test_plistlib
test_plistlib skipped -- No module named plistlib
test_poll
test_popen
[7360 refs]
[7360 refs]
[7360 refs]
test_popen2
test_poplib
test_posix
test_posixpath
test_pow
test_pprint
test_profile
test_profilehooks
test_pty
test_pwd
test_pyclbr
test_pyexpat
test_queue
test_quopri
[7735 refs]
[7735 refs]
test_random
test_re
test_repr
test_resource
test_rfc822
test_richcmp
test_robotparser
test_runpy
test_sax
test_scope
test_scriptpackages
test_scriptpackages skipped -- No module named aetools
test_select
test_set
test_sets
test_sgmllib
test_sha
test_shelve
test_shlex
test_shutil
test_signal
test_site
test_slice
test_smtplib
test_socket
test_socket_ssl
/tmp/python-test/local/lib/python2.6/test/test_socket_ssl.py:97: DeprecationWarning: socket.ssl() is deprecated. Use ssl.wrap_socket() instead.
ssl_sock = socket.ssl(s)
/tmp/python-test/local/lib/python2.6/test/test_socket_ssl.py:63: DeprecationWarning: socket.ssl() is deprecated. Use ssl.wrap_socket() instead.
ss = socket.ssl(s)
test_socketserver
test_softspace
test_sort
test_sqlite
test_ssl
test_startfile
test_startfile skipped -- cannot import name startfile
test_str
test_strftime
test_string
test_stringprep
test_strop
test_strptime
test_struct
test_structmembers
test_structseq
test_subprocess
[7355 refs]
[7353 refs]
[7355 refs]
[7355 refs]
[7355 refs]
[7355 refs]
[7355 refs]
[7355 refs]
[7355 refs]
[7355 refs]
[7353 refs]
[8966 refs]
[7571 refs]
[7356 refs]
[7355 refs]
[7355 refs]
[7355 refs]
[7355 refs]
[7355 refs]
.
[7355 refs]
[7355 refs]
this bit of output is from a test of stdout in a different process ...
[7355 refs]
[7355 refs]
[7571 refs]
test_sunaudiodev
test_sunaudiodev skipped -- No module named sunaudiodev
test_sundry
test_symtable
test_syntax
test_sys
[7355 refs]
[7355 refs]
test_tarfile
test_tcl
test_tcl skipped -- No module named _tkinter
test_telnetlib
test_tempfile
[7359 refs]
test_textwrap
test_thread
test_threaded_import
test_threadedtempfile
test_threading
test_threading_local
test_threadsignals
test_time
test_timeout
test_tokenize
test_trace
test_traceback
test_transformer
test_tuple
test_typechecks
test_ucn
test_unary
test_unicode
test_unicode_file
test_unicode_file skipped -- No Unicode filesystem semantics on this platform.
test_unicodedata
test_univnewlines
test_unpack
test_urllib
test_urllib2
test_urllib2_localnet
test_urllib2net
test_urllibnet
test_urlparse
test_userdict
test_userlist
test_userstring
test_uu
test_uuid
WARNING: uuid.getnode is unreliable on many platforms.
It is disabled until the code and/or test can be fixed properly.
WARNING: uuid._ifconfig_getnode is unreliable on many platforms.
It is disabled until the code and/or test can be fixed properly.
WARNING: uuid._unixdll_getnode is unreliable on many platforms.
It is disabled until the code and/or test can be fixed properly.
test_wait3
test_wait4
test_warnings
test_wave
test_weakref
test_whichdb
test_winreg
test_winreg skipped -- No module named _winreg
test_winsound
test_winsound skipped -- No module named winsound
test_with
test_wsgiref
test_xdrlib
test_xml_etree
test_xml_etree_c
test_xmllib
test_xmlrpc
test_xpickle
test_xrange
test_zipfile
test_zipfile64
test_zipfile64 skipped -- test requires loads of disk-space bytes and a long time to run
test_zipimport
test_zlib
307 tests OK.
1 test failed:
test_asynchat
21 tests skipped:
test_aepack test_al test_applesingle test_bsddb185 test_cd test_cl
test_gl test_imageop test_imgfile test_ioctl test_macostools
test_pep277 test_plistlib test_scriptpackages test_startfile
test_sunaudiodev test_tcl test_unicode_file test_winreg
test_winsound test_zipfile64
1 skip unexpected on linux2:
test_ioctl
[516557 refs]
1
0
Author: neal.norwitz
Date: Sat Oct 6 21:16:28 2007
New Revision: 58351
Modified:
python/trunk/Lib/test/test_bufio.py
Log:
Ensure that this test will pass even if another test left an unwritable TESTFN.
Also use the safe unlink in test_support instead of rolling our own here.
Modified: python/trunk/Lib/test/test_bufio.py
==============================================================================
--- python/trunk/Lib/test/test_bufio.py (original)
+++ python/trunk/Lib/test/test_bufio.py Sat Oct 6 21:16:28 2007
@@ -13,6 +13,9 @@
# Write s + "\n" + s to file, then open it and ensure that successive
# .readline()s deliver what we wrote.
+ # Ensure we can open TESTFN for writing.
+ test_support.unlink(test_support.TESTFN)
+
# Since C doesn't guarantee we can write/read arbitrary bytes in text
# files, use binary mode.
f = open(test_support.TESTFN, "wb")
@@ -31,11 +34,7 @@
self.assert_(not line) # Must be at EOF
f.close()
finally:
- try:
- import os
- os.unlink(test_support.TESTFN)
- except:
- pass
+ test_support.unlink(test_support.TESTFN)
def drive_one(self, pattern):
for length in lengths:
1
0
test_grammar
test_opcodes
test_dict
test_builtin
test_exceptions
test_types
test_unittest
test_doctest
test_doctest2
test_MimeWriter
test_StringIO
test___all__
test___future__
test__locale
test_abc
test_aepack
test_aepack skipped -- No module named aepack
test_al
test_al skipped -- No module named al
test_anydbm
test_applesingle
test_applesingle skipped -- No module named macostools
test_array
test_ast
test_asynchat
WARNING: failed to listen on port 54322, trying another
WARNING: failed to listen on port 9907, trying another
WARNING: failed to listen on port 10243, trying another
test_asyncore
test_atexit
test_audioop
test_augassign
test_base64
test_bastion
test_bigaddrspace
test_bigmem
test_binascii
test_binhex
test_binop
test_bisect
test_bool
test_bsddb
test_bsddb185
test_bsddb185 skipped -- No module named bsddb185
test_bsddb3
test_bsddb3 skipped -- Use of the `bsddb' resource not enabled
test_buffer
test_bufio
test_bz2
test_cProfile
test_calendar
test_call
test_capi
test_cd
test_cd skipped -- No module named cd
test_cfgparser
test_cgi
test_charmapcodec
test_cl
test_cl skipped -- No module named cl
test_class
test_cmath
test_cmd_line
test_code
test_codeccallbacks
test_codecencodings_cn
test_codecencodings_hk
test_codecencodings_jp
test_codecencodings_kr
test_codecencodings_tw
test_codecmaps_cn
test_codecmaps_cn skipped -- Use of the `urlfetch' resource not enabled
test_codecmaps_hk
test_codecmaps_hk skipped -- Use of the `urlfetch' resource not enabled
test_codecmaps_jp
test_codecmaps_jp skipped -- Use of the `urlfetch' resource not enabled
test_codecmaps_kr
test_codecmaps_kr skipped -- Use of the `urlfetch' resource not enabled
test_codecmaps_tw
test_codecmaps_tw skipped -- Use of the `urlfetch' resource not enabled
test_codecs
test_codeop
test_coding
test_coercion
test_collections
test_colorsys
test_commands
test_compare
test_compile
test_compiler
test_complex
test_complex_args
test_contains
test_contextlib
test_cookie
test_cookielib
test_copy
test_copy_reg
test_cpickle
test_crypt
test_csv
test_ctypes
test_curses
test_curses skipped -- Use of the `curses' resource not enabled
test_datetime
test_dbm
test_decimal
test_decorators
test_defaultdict
test_deque
test_descr
test_descrtut
test_difflib
test_dircache
test_dis
test_distutils
[9105 refs]
test_dl
test_dumbdbm
test_dummy_thread
test_dummy_threading
test_email
test_email_codecs
test_email_renamed
test_enumerate
test_eof
test_errno
test_exception_variations
test_extcall
test_fcntl
test_file
test_filecmp
test_fileinput
test_float
test_fnmatch
test_fork1
test_format
test_fpformat
test_frozen
test_ftplib
test_funcattrs
test_functools
test_future
test_gc
test_gdbm
test_generators
test_genericpath
test_genexps
test_getargs
test_getargs2
test_getopt
test_gettext
test_gl
test_gl skipped -- No module named gl
test_glob
test_global
test_grp
test_gzip
test_hash
test_hashlib
test_heapq
test_hexoct
test_hmac
test_hotshot
test_htmllib
test_htmlparser
test_httplib
test_imageop
test_imageop skipped -- No module named imgfile
test_imaplib
test_imgfile
test_imgfile skipped -- No module named imgfile
test_imp
test_import
test_importhooks
test_index
test_inspect
test_ioctl
test_ioctl skipped -- Unable to open /dev/tty
test_isinstance
test_iter
test_iterlen
test_itertools
test_largefile
test_linuxaudiodev
test_linuxaudiodev skipped -- Use of the `audio' resource not enabled
test_list
test_locale
test_logging
test_long
test_long_future
test_longexp
test_macostools
test_macostools skipped -- No module named macostools
test_macpath
test_mailbox
test_marshal
test_math
test_md5
test_mhlib
test_mimetools
test_mimetypes
test_minidom
test_mmap
test_module
test_modulefinder
test_multibytecodec
test_multibytecodec_support
test_multifile
test_mutants
test_netrc
test_new
test_nis
test_normalization
test_normalization skipped -- Use of the `urlfetch' resource not enabled
test_ntpath
test_old_mailbox
test_openpty
test_operator
test_optparse
test_os
test_ossaudiodev
test_ossaudiodev skipped -- Use of the `audio' resource not enabled
test_parser
test_peepholer
test_pep247
test_pep263
test_pep277
test_pep277 skipped -- test works only on NT+
test_pep292
test_pep352
test_pickle
test_pickletools
test_pipes
test_pkg
test_pkgimport
test_platform
test_plistlib
test_plistlib skipped -- No module named plistlib
test_poll
test_popen
[7360 refs]
[7360 refs]
[7360 refs]
test_popen2
test_poplib
test_posix
test_posixpath
test_pow
test_pprint
test_profile
test_profilehooks
test_pty
test_pwd
test_pyclbr
test_pyexpat
test_queue
test_quopri
[7735 refs]
[7735 refs]
test_random
test_re
test_repr
test_resource
test_rfc822
test_richcmp
test_robotparser
test_runpy
test_sax
test_scope
test_scriptpackages
test_scriptpackages skipped -- No module named aetools
test_select
test_set
test_sets
test_sgmllib
test_sha
test_shelve
test_shlex
test_shutil
test_signal
test_site
test_slice
test_smtplib
test_socket
test_socket_ssl
/tmp/python-test/local/lib/python2.6/test/test_socket_ssl.py:97: DeprecationWarning: socket.ssl() is deprecated. Use ssl.wrap_socket() instead.
ssl_sock = socket.ssl(s)
test_socketserver
test_socketserver skipped -- Use of the `network' resource not enabled
test_softspace
test_sort
test_sqlite
test_ssl
test_startfile
test_startfile skipped -- cannot import name startfile
test_str
test_strftime
test_string
test_stringprep
test_strop
test_strptime
test_struct
test_structmembers
test_structseq
test_subprocess
[7355 refs]
[7353 refs]
[7355 refs]
[7355 refs]
[7355 refs]
[7355 refs]
[7355 refs]
[7355 refs]
[7355 refs]
[7355 refs]
[7353 refs]
[8966 refs]
[7571 refs]
[7356 refs]
[7355 refs]
[7355 refs]
[7355 refs]
[7355 refs]
[7355 refs]
.
[7355 refs]
[7355 refs]
this bit of output is from a test of stdout in a different process ...
[7355 refs]
[7355 refs]
[7571 refs]
test_sunaudiodev
test_sunaudiodev skipped -- No module named sunaudiodev
test_sundry
test_symtable
test_syntax
test_sys
[7355 refs]
[7355 refs]
test_tarfile
test_tcl
test_tcl skipped -- No module named _tkinter
test_telnetlib
test test_telnetlib failed -- Traceback (most recent call last):
File "/tmp/python-test/local/lib/python2.6/test/test_telnetlib.py", line 41, in testTimeoutDefault
telnet = telnetlib.Telnet("localhost", 9091)
File "/tmp/python-test/local/lib/python2.6/telnetlib.py", line 209, in __init__
self.open(host, port, timeout)
File "/tmp/python-test/local/lib/python2.6/telnetlib.py", line 227, in open
self.sock = socket.create_connection((host, port), self.timeout)
File "/tmp/python-test/local/lib/python2.6/socket.py", line 462, in create_connection
raise error, msg
error: [Errno 111] Connection refused
test_tempfile
[7362 refs]
test_textwrap
test_thread
test_threaded_import
test_threadedtempfile
test_threading
test_threading_local
test_threadsignals
test_time
test_timeout
test_timeout skipped -- Use of the `network' resource not enabled
test_tokenize
test_trace
test_traceback
test_transformer
test_tuple
test_typechecks
test_ucn
test_unary
test_unicode
test_unicode_file
test_unicode_file skipped -- No Unicode filesystem semantics on this platform.
test_unicodedata
test_univnewlines
test_unpack
test_urllib
test_urllib2
test_urllib2_localnet
test_urllib2net
test_urllib2net skipped -- Use of the `network' resource not enabled
test_urllibnet
test_urllibnet skipped -- Use of the `network' resource not enabled
test_urlparse
test_userdict
test_userlist
test_userstring
test_uu
test_uuid
WARNING: uuid.getnode is unreliable on many platforms.
It is disabled until the code and/or test can be fixed properly.
WARNING: uuid._ifconfig_getnode is unreliable on many platforms.
It is disabled until the code and/or test can be fixed properly.
WARNING: uuid._unixdll_getnode is unreliable on many platforms.
It is disabled until the code and/or test can be fixed properly.
test_wait3
test_wait4
test_warnings
test_wave
test_weakref
test_whichdb
test_winreg
test_winreg skipped -- No module named _winreg
test_winsound
test_winsound skipped -- No module named winsound
test_with
test_wsgiref
test_xdrlib
test_xml_etree
test_xml_etree_c
test_xmllib
test_xmlrpc
test_xpickle
test_xrange
test_zipfile
test_zipfile64
test_zipfile64 skipped -- test requires loads of disk-space bytes and a long time to run
test_zipimport
test_zlib
296 tests OK.
1 test failed:
test_telnetlib
35 tests skipped:
test_aepack test_al test_applesingle test_bsddb185 test_bsddb3
test_cd test_cl test_codecmaps_cn test_codecmaps_hk
test_codecmaps_jp test_codecmaps_kr test_codecmaps_tw test_curses
test_gl test_imageop test_imgfile test_ioctl test_linuxaudiodev
test_macostools test_normalization test_ossaudiodev test_pep277
test_plistlib test_scriptpackages test_socketserver test_startfile
test_sunaudiodev test_tcl test_timeout test_unicode_file
test_urllib2net test_urllibnet test_winreg test_winsound
test_zipfile64
1 skip unexpected on linux2:
test_ioctl
[506352 refs]
2
1
The Buildbot has detected a new failure of ARM Linux EABI 2.5.
Full details are available at:
http://www.python.org/dev/buildbot/all/ARM%20Linux%20EABI%202.5/builds/2
Buildbot URL: http://www.python.org/dev/buildbot/all/
Buildslave for this Build: klose-linux-armeabi
Build Reason:
Build Source Stamp: [branch branches/release25-maint] HEAD
Blamelist: gregory.p.smith
BUILD FAILED: failed test
Excerpt from the test logfile:
Traceback (most recent call last):
File "/home/pybot/buildarea-armeabi/2.5.klose-linux-armeabi/build/Lib/threading.py", line 460, in __bootstrap
self.run()
File "/home/pybot/buildarea-armeabi/2.5.klose-linux-armeabi/build/Lib/test/test_socketserver.py", line 81, in run
svr = svrcls(self.__addr, self.__hdlrcls)
File "/home/pybot/buildarea-armeabi/2.5.klose-linux-armeabi/build/Lib/SocketServer.py", line 330, in __init__
self.server_bind()
File "/home/pybot/buildarea-armeabi/2.5.klose-linux-armeabi/build/Lib/test/test_socketserver.py", line 159, in server_bind
TCPServer.server_bind(self)
File "/home/pybot/buildarea-armeabi/2.5.klose-linux-armeabi/build/Lib/SocketServer.py", line 341, in server_bind
self.socket.bind(self.server_address)
File "<string>", line 1, in bind
gaierror: (-2, 'Name or service not known')
6 tests failed:
test_bsddb3 test_resource test_socket test_socket_ssl
test_socketserver test_urllib2
======================================================================
FAIL: test_get_key (bsddb.test.test_sequence.DBSequenceTest)
----------------------------------------------------------------------
Traceback (most recent call last):
File "/home/pybot/buildarea-armeabi/2.5.klose-linux-armeabi/build/Lib/bsddb/test/test_sequence.py", line 67, in test_get_key
self.assertEquals(key, self.seq.get_key())
AssertionError: 'foo' != ''
Traceback (most recent call last):
File "./Lib/test/regrtest.py", line 549, in runtest_inner
the_package = __import__(abstest, globals(), locals(), [])
File "/home/pybot/buildarea-armeabi/2.5.klose-linux-armeabi/build/Lib/test/test_resource.py", line 42, in <module>
f.close()
IOError: [Errno 27] File too large
======================================================================
ERROR: testGetServBy (test.test_socket.GeneralModuleTests)
----------------------------------------------------------------------
Traceback (most recent call last):
File "/home/pybot/buildarea-armeabi/2.5.klose-linux-armeabi/build/Lib/test/test_socket.py", line 332, in testGetServBy
raise socket.error
error
======================================================================
ERROR: testFromFd (test.test_socket.BasicTCPTest)
----------------------------------------------------------------------
Traceback (most recent call last):
File "/home/pybot/buildarea-armeabi/2.5.klose-linux-armeabi/build/Lib/test/test_socket.py", line 111, in _setUp
self.__setUp()
File "/home/pybot/buildarea-armeabi/2.5.klose-linux-armeabi/build/Lib/test/test_socket.py", line 172, in setUp
ThreadedTCPSocketTest.setUp(self)
File "/home/pybot/buildarea-armeabi/2.5.klose-linux-armeabi/build/Lib/test/test_socket.py", line 26, in setUp
PORT = test_support.bind_port(self.serv, HOST, PORT)
File "/home/pybot/buildarea-armeabi/2.5.klose-linux-armeabi/build/Lib/test/test_support.py", line 101, in bind_port
sock.bind((host, port))
File "<string>", line 1, in bind
gaierror: (-2, 'Name or service not known')
======================================================================
ERROR: testOverFlowRecv (test.test_socket.BasicTCPTest)
----------------------------------------------------------------------
Traceback (most recent call last):
File "/home/pybot/buildarea-armeabi/2.5.klose-linux-armeabi/build/Lib/test/test_socket.py", line 111, in _setUp
self.__setUp()
File "/home/pybot/buildarea-armeabi/2.5.klose-linux-armeabi/build/Lib/test/test_socket.py", line 172, in setUp
ThreadedTCPSocketTest.setUp(self)
File "/home/pybot/buildarea-armeabi/2.5.klose-linux-armeabi/build/Lib/test/test_socket.py", line 26, in setUp
PORT = test_support.bind_port(self.serv, HOST, PORT)
File "/home/pybot/buildarea-armeabi/2.5.klose-linux-armeabi/build/Lib/test/test_support.py", line 101, in bind_port
sock.bind((host, port))
File "<string>", line 1, in bind
gaierror: (-2, 'Name or service not known')
======================================================================
ERROR: testOverFlowRecvFrom (test.test_socket.BasicTCPTest)
----------------------------------------------------------------------
Traceback (most recent call last):
File "/home/pybot/buildarea-armeabi/2.5.klose-linux-armeabi/build/Lib/test/test_socket.py", line 111, in _setUp
self.__setUp()
File "/home/pybot/buildarea-armeabi/2.5.klose-linux-armeabi/build/Lib/test/test_socket.py", line 172, in setUp
ThreadedTCPSocketTest.setUp(self)
File "/home/pybot/buildarea-armeabi/2.5.klose-linux-armeabi/build/Lib/test/test_socket.py", line 26, in setUp
PORT = test_support.bind_port(self.serv, HOST, PORT)
File "/home/pybot/buildarea-armeabi/2.5.klose-linux-armeabi/build/Lib/test/test_support.py", line 101, in bind_port
sock.bind((host, port))
File "<string>", line 1, in bind
gaierror: (-2, 'Name or service not known')
======================================================================
ERROR: testRecv (test.test_socket.BasicTCPTest)
----------------------------------------------------------------------
Traceback (most recent call last):
File "/home/pybot/buildarea-armeabi/2.5.klose-linux-armeabi/build/Lib/test/test_socket.py", line 111, in _setUp
self.__setUp()
File "/home/pybot/buildarea-armeabi/2.5.klose-linux-armeabi/build/Lib/test/test_socket.py", line 172, in setUp
ThreadedTCPSocketTest.setUp(self)
File "/home/pybot/buildarea-armeabi/2.5.klose-linux-armeabi/build/Lib/test/test_socket.py", line 26, in setUp
PORT = test_support.bind_port(self.serv, HOST, PORT)
File "/home/pybot/buildarea-armeabi/2.5.klose-linux-armeabi/build/Lib/test/test_support.py", line 101, in bind_port
sock.bind((host, port))
File "<string>", line 1, in bind
gaierror: (-2, 'Name or service not known')
======================================================================
ERROR: testRecvFrom (test.test_socket.BasicTCPTest)
----------------------------------------------------------------------
Traceback (most recent call last):
File "/home/pybot/buildarea-armeabi/2.5.klose-linux-armeabi/build/Lib/test/test_socket.py", line 111, in _setUp
self.__setUp()
File "/home/pybot/buildarea-armeabi/2.5.klose-linux-armeabi/build/Lib/test/test_socket.py", line 172, in setUp
ThreadedTCPSocketTest.setUp(self)
File "/home/pybot/buildarea-armeabi/2.5.klose-linux-armeabi/build/Lib/test/test_socket.py", line 26, in setUp
PORT = test_support.bind_port(self.serv, HOST, PORT)
File "/home/pybot/buildarea-armeabi/2.5.klose-linux-armeabi/build/Lib/test/test_support.py", line 101, in bind_port
sock.bind((host, port))
File "<string>", line 1, in bind
gaierror: (-2, 'Name or service not known')
======================================================================
ERROR: testSendAll (test.test_socket.BasicTCPTest)
----------------------------------------------------------------------
Traceback (most recent call last):
File "/home/pybot/buildarea-armeabi/2.5.klose-linux-armeabi/build/Lib/test/test_socket.py", line 111, in _setUp
self.__setUp()
File "/home/pybot/buildarea-armeabi/2.5.klose-linux-armeabi/build/Lib/test/test_socket.py", line 172, in setUp
ThreadedTCPSocketTest.setUp(self)
File "/home/pybot/buildarea-armeabi/2.5.klose-linux-armeabi/build/Lib/test/test_socket.py", line 26, in setUp
PORT = test_support.bind_port(self.serv, HOST, PORT)
File "/home/pybot/buildarea-armeabi/2.5.klose-linux-armeabi/build/Lib/test/test_support.py", line 101, in bind_port
sock.bind((host, port))
File "<string>", line 1, in bind
gaierror: (-2, 'Name or service not known')
======================================================================
ERROR: testShutdown (test.test_socket.BasicTCPTest)
----------------------------------------------------------------------
Traceback (most recent call last):
File "/home/pybot/buildarea-armeabi/2.5.klose-linux-armeabi/build/Lib/test/test_socket.py", line 111, in _setUp
self.__setUp()
File "/home/pybot/buildarea-armeabi/2.5.klose-linux-armeabi/build/Lib/test/test_socket.py", line 172, in setUp
ThreadedTCPSocketTest.setUp(self)
File "/home/pybot/buildarea-armeabi/2.5.klose-linux-armeabi/build/Lib/test/test_socket.py", line 26, in setUp
PORT = test_support.bind_port(self.serv, HOST, PORT)
File "/home/pybot/buildarea-armeabi/2.5.klose-linux-armeabi/build/Lib/test/test_support.py", line 101, in bind_port
sock.bind((host, port))
File "<string>", line 1, in bind
gaierror: (-2, 'Name or service not known')
======================================================================
ERROR: testClose (test.test_socket.TCPCloserTest)
----------------------------------------------------------------------
Traceback (most recent call last):
File "/home/pybot/buildarea-armeabi/2.5.klose-linux-armeabi/build/Lib/test/test_socket.py", line 111, in _setUp
self.__setUp()
File "/home/pybot/buildarea-armeabi/2.5.klose-linux-armeabi/build/Lib/test/test_socket.py", line 26, in setUp
PORT = test_support.bind_port(self.serv, HOST, PORT)
File "/home/pybot/buildarea-armeabi/2.5.klose-linux-armeabi/build/Lib/test/test_support.py", line 101, in bind_port
sock.bind((host, port))
File "<string>", line 1, in bind
gaierror: (-2, 'Name or service not known')
======================================================================
ERROR: testInterruptedTimeout (test.test_socket.TCPTimeoutTest)
----------------------------------------------------------------------
Traceback (most recent call last):
File "/home/pybot/buildarea-armeabi/2.5.klose-linux-armeabi/build/Lib/test/test_socket.py", line 26, in setUp
PORT = test_support.bind_port(self.serv, HOST, PORT)
File "/home/pybot/buildarea-armeabi/2.5.klose-linux-armeabi/build/Lib/test/test_support.py", line 101, in bind_port
sock.bind((host, port))
File "<string>", line 1, in bind
gaierror: (-2, 'Name or service not known')
======================================================================
ERROR: testTCPTimeout (test.test_socket.TCPTimeoutTest)
----------------------------------------------------------------------
Traceback (most recent call last):
File "/home/pybot/buildarea-armeabi/2.5.klose-linux-armeabi/build/Lib/test/test_socket.py", line 26, in setUp
PORT = test_support.bind_port(self.serv, HOST, PORT)
File "/home/pybot/buildarea-armeabi/2.5.klose-linux-armeabi/build/Lib/test/test_support.py", line 101, in bind_port
sock.bind((host, port))
File "<string>", line 1, in bind
gaierror: (-2, 'Name or service not known')
======================================================================
ERROR: testTimeoutZero (test.test_socket.TCPTimeoutTest)
----------------------------------------------------------------------
Traceback (most recent call last):
File "/home/pybot/buildarea-armeabi/2.5.klose-linux-armeabi/build/Lib/test/test_socket.py", line 26, in setUp
PORT = test_support.bind_port(self.serv, HOST, PORT)
File "/home/pybot/buildarea-armeabi/2.5.klose-linux-armeabi/build/Lib/test/test_support.py", line 101, in bind_port
sock.bind((host, port))
File "<string>", line 1, in bind
gaierror: (-2, 'Name or service not known')
======================================================================
ERROR: testRecvFromInto (test.test_socket.BufferIOTest)
----------------------------------------------------------------------
Traceback (most recent call last):
File "/home/pybot/buildarea-armeabi/2.5.klose-linux-armeabi/build/Lib/test/test_socket.py", line 111, in _setUp
self.__setUp()
File "/home/pybot/buildarea-armeabi/2.5.klose-linux-armeabi/build/Lib/test/test_socket.py", line 172, in setUp
ThreadedTCPSocketTest.setUp(self)
File "/home/pybot/buildarea-armeabi/2.5.klose-linux-armeabi/build/Lib/test/test_socket.py", line 26, in setUp
PORT = test_support.bind_port(self.serv, HOST, PORT)
File "/home/pybot/buildarea-armeabi/2.5.klose-linux-armeabi/build/Lib/test/test_support.py", line 101, in bind_port
sock.bind((host, port))
File "<string>", line 1, in bind
gaierror: (-2, 'Name or service not known')
======================================================================
ERROR: testRecvInto (test.test_socket.BufferIOTest)
----------------------------------------------------------------------
Traceback (most recent call last):
File "/home/pybot/buildarea-armeabi/2.5.klose-linux-armeabi/build/Lib/test/test_socket.py", line 111, in _setUp
self.__setUp()
File "/home/pybot/buildarea-armeabi/2.5.klose-linux-armeabi/build/Lib/test/test_socket.py", line 172, in setUp
ThreadedTCPSocketTest.setUp(self)
File "/home/pybot/buildarea-armeabi/2.5.klose-linux-armeabi/build/Lib/test/test_socket.py", line 26, in setUp
PORT = test_support.bind_port(self.serv, HOST, PORT)
File "/home/pybot/buildarea-armeabi/2.5.klose-linux-armeabi/build/Lib/test/test_support.py", line 101, in bind_port
sock.bind((host, port))
File "<string>", line 1, in bind
gaierror: (-2, 'Name or service not known')
======================================================================
ERROR: testRecvFrom (test.test_socket.BasicUDPTest)
----------------------------------------------------------------------
Traceback (most recent call last):
File "/home/pybot/buildarea-armeabi/2.5.klose-linux-armeabi/build/Lib/test/test_socket.py", line 111, in _setUp
self.__setUp()
File "/home/pybot/buildarea-armeabi/2.5.klose-linux-armeabi/build/Lib/test/test_socket.py", line 39, in setUp
PORT = test_support.bind_port(self.serv, HOST, PORT)
File "/home/pybot/buildarea-armeabi/2.5.klose-linux-armeabi/build/Lib/test/test_support.py", line 101, in bind_port
sock.bind((host, port))
File "<string>", line 1, in bind
gaierror: (-2, 'Name or service not known')
======================================================================
ERROR: testRecvFromNegative (test.test_socket.BasicUDPTest)
----------------------------------------------------------------------
Traceback (most recent call last):
File "/home/pybot/buildarea-armeabi/2.5.klose-linux-armeabi/build/Lib/test/test_socket.py", line 111, in _setUp
self.__setUp()
File "/home/pybot/buildarea-armeabi/2.5.klose-linux-armeabi/build/Lib/test/test_socket.py", line 39, in setUp
PORT = test_support.bind_port(self.serv, HOST, PORT)
File "/home/pybot/buildarea-armeabi/2.5.klose-linux-armeabi/build/Lib/test/test_support.py", line 101, in bind_port
sock.bind((host, port))
File "<string>", line 1, in bind
gaierror: (-2, 'Name or service not known')
======================================================================
ERROR: testSendtoAndRecv (test.test_socket.BasicUDPTest)
----------------------------------------------------------------------
Traceback (most recent call last):
File "/home/pybot/buildarea-armeabi/2.5.klose-linux-armeabi/build/Lib/test/test_socket.py", line 111, in _setUp
self.__setUp()
File "/home/pybot/buildarea-armeabi/2.5.klose-linux-armeabi/build/Lib/test/test_socket.py", line 39, in setUp
PORT = test_support.bind_port(self.serv, HOST, PORT)
File "/home/pybot/buildarea-armeabi/2.5.klose-linux-armeabi/build/Lib/test/test_support.py", line 101, in bind_port
sock.bind((host, port))
File "<string>", line 1, in bind
gaierror: (-2, 'Name or service not known')
======================================================================
ERROR: testTimeoutZero (test.test_socket.UDPTimeoutTest)
----------------------------------------------------------------------
Traceback (most recent call last):
File "/home/pybot/buildarea-armeabi/2.5.klose-linux-armeabi/build/Lib/test/test_socket.py", line 26, in setUp
PORT = test_support.bind_port(self.serv, HOST, PORT)
File "/home/pybot/buildarea-armeabi/2.5.klose-linux-armeabi/build/Lib/test/test_support.py", line 101, in bind_port
sock.bind((host, port))
File "<string>", line 1, in bind
gaierror: (-2, 'Name or service not known')
======================================================================
ERROR: testUDPTimeout (test.test_socket.UDPTimeoutTest)
----------------------------------------------------------------------
Traceback (most recent call last):
File "/home/pybot/buildarea-armeabi/2.5.klose-linux-armeabi/build/Lib/test/test_socket.py", line 26, in setUp
PORT = test_support.bind_port(self.serv, HOST, PORT)
File "/home/pybot/buildarea-armeabi/2.5.klose-linux-armeabi/build/Lib/test/test_support.py", line 101, in bind_port
sock.bind((host, port))
File "<string>", line 1, in bind
gaierror: (-2, 'Name or service not known')
======================================================================
ERROR: testAccept (test.test_socket.NonBlockingTCPTests)
----------------------------------------------------------------------
Traceback (most recent call last):
File "/home/pybot/buildarea-armeabi/2.5.klose-linux-armeabi/build/Lib/test/test_socket.py", line 111, in _setUp
self.__setUp()
File "/home/pybot/buildarea-armeabi/2.5.klose-linux-armeabi/build/Lib/test/test_socket.py", line 26, in setUp
PORT = test_support.bind_port(self.serv, HOST, PORT)
File "/home/pybot/buildarea-armeabi/2.5.klose-linux-armeabi/build/Lib/test/test_support.py", line 101, in bind_port
sock.bind((host, port))
File "<string>", line 1, in bind
gaierror: (-2, 'Name or service not known')
======================================================================
ERROR: testConnect (test.test_socket.NonBlockingTCPTests)
----------------------------------------------------------------------
Traceback (most recent call last):
File "/home/pybot/buildarea-armeabi/2.5.klose-linux-armeabi/build/Lib/test/test_socket.py", line 111, in _setUp
self.__setUp()
File "/home/pybot/buildarea-armeabi/2.5.klose-linux-armeabi/build/Lib/test/test_socket.py", line 26, in setUp
PORT = test_support.bind_port(self.serv, HOST, PORT)
File "/home/pybot/buildarea-armeabi/2.5.klose-linux-armeabi/build/Lib/test/test_support.py", line 101, in bind_port
sock.bind((host, port))
File "<string>", line 1, in bind
gaierror: (-2, 'Name or service not known')
======================================================================
ERROR: testRecv (test.test_socket.NonBlockingTCPTests)
----------------------------------------------------------------------
Traceback (most recent call last):
File "/home/pybot/buildarea-armeabi/2.5.klose-linux-armeabi/build/Lib/test/test_socket.py", line 111, in _setUp
self.__setUp()
File "/home/pybot/buildarea-armeabi/2.5.klose-linux-armeabi/build/Lib/test/test_socket.py", line 26, in setUp
PORT = test_support.bind_port(self.serv, HOST, PORT)
File "/home/pybot/buildarea-armeabi/2.5.klose-linux-armeabi/build/Lib/test/test_support.py", line 101, in bind_port
sock.bind((host, port))
File "<string>", line 1, in bind
gaierror: (-2, 'Name or service not known')
======================================================================
ERROR: testSetBlocking (test.test_socket.NonBlockingTCPTests)
----------------------------------------------------------------------
Traceback (most recent call last):
File "/home/pybot/buildarea-armeabi/2.5.klose-linux-armeabi/build/Lib/test/test_socket.py", line 111, in _setUp
self.__setUp()
File "/home/pybot/buildarea-armeabi/2.5.klose-linux-armeabi/build/Lib/test/test_socket.py", line 26, in setUp
PORT = test_support.bind_port(self.serv, HOST, PORT)
File "/home/pybot/buildarea-armeabi/2.5.klose-linux-armeabi/build/Lib/test/test_support.py", line 101, in bind_port
sock.bind((host, port))
File "<string>", line 1, in bind
gaierror: (-2, 'Name or service not known')
======================================================================
ERROR: testClosedAttr (test.test_socket.FileObjectClassTestCase)
----------------------------------------------------------------------
Traceback (most recent call last):
File "/home/pybot/buildarea-armeabi/2.5.klose-linux-armeabi/build/Lib/test/test_socket.py", line 111, in _setUp
self.__setUp()
File "/home/pybot/buildarea-armeabi/2.5.klose-linux-armeabi/build/Lib/test/test_socket.py", line 703, in setUp
SocketConnectedTest.setUp(self)
File "/home/pybot/buildarea-armeabi/2.5.klose-linux-armeabi/build/Lib/test/test_socket.py", line 172, in setUp
ThreadedTCPSocketTest.setUp(self)
File "/home/pybot/buildarea-armeabi/2.5.klose-linux-armeabi/build/Lib/test/test_socket.py", line 26, in setUp
PORT = test_support.bind_port(self.serv, HOST, PORT)
File "/home/pybot/buildarea-armeabi/2.5.klose-linux-armeabi/build/Lib/test/test_support.py", line 101, in bind_port
sock.bind((host, port))
File "<string>", line 1, in bind
gaierror: (-2, 'Name or service not known')
======================================================================
ERROR: testFullRead (test.test_socket.FileObjectClassTestCase)
----------------------------------------------------------------------
Traceback (most recent call last):
File "/home/pybot/buildarea-armeabi/2.5.klose-linux-armeabi/build/Lib/test/test_socket.py", line 111, in _setUp
self.__setUp()
File "/home/pybot/buildarea-armeabi/2.5.klose-linux-armeabi/build/Lib/test/test_socket.py", line 703, in setUp
SocketConnectedTest.setUp(self)
File "/home/pybot/buildarea-armeabi/2.5.klose-linux-armeabi/build/Lib/test/test_socket.py", line 172, in setUp
ThreadedTCPSocketTest.setUp(self)
File "/home/pybot/buildarea-armeabi/2.5.klose-linux-armeabi/build/Lib/test/test_socket.py", line 26, in setUp
PORT = test_support.bind_port(self.serv, HOST, PORT)
File "/home/pybot/buildarea-armeabi/2.5.klose-linux-armeabi/build/Lib/test/test_support.py", line 101, in bind_port
sock.bind((host, port))
File "<string>", line 1, in bind
gaierror: (-2, 'Name or service not known')
======================================================================
ERROR: testReadline (test.test_socket.FileObjectClassTestCase)
----------------------------------------------------------------------
Traceback (most recent call last):
File "/home/pybot/buildarea-armeabi/2.5.klose-linux-armeabi/build/Lib/test/test_socket.py", line 111, in _setUp
self.__setUp()
File "/home/pybot/buildarea-armeabi/2.5.klose-linux-armeabi/build/Lib/test/test_socket.py", line 703, in setUp
SocketConnectedTest.setUp(self)
File "/home/pybot/buildarea-armeabi/2.5.klose-linux-armeabi/build/Lib/test/test_socket.py", line 172, in setUp
ThreadedTCPSocketTest.setUp(self)
File "/home/pybot/buildarea-armeabi/2.5.klose-linux-armeabi/build/Lib/test/test_socket.py", line 26, in setUp
PORT = test_support.bind_port(self.serv, HOST, PORT)
File "/home/pybot/buildarea-armeabi/2.5.klose-linux-armeabi/build/Lib/test/test_support.py", line 101, in bind_port
sock.bind((host, port))
File "<string>", line 1, in bind
gaierror: (-2, 'Name or service not known')
======================================================================
ERROR: testSmallRead (test.test_socket.FileObjectClassTestCase)
----------------------------------------------------------------------
Traceback (most recent call last):
File "/home/pybot/buildarea-armeabi/2.5.klose-linux-armeabi/build/Lib/test/test_socket.py", line 111, in _setUp
self.__setUp()
File "/home/pybot/buildarea-armeabi/2.5.klose-linux-armeabi/build/Lib/test/test_socket.py", line 703, in setUp
SocketConnectedTest.setUp(self)
File "/home/pybot/buildarea-armeabi/2.5.klose-linux-armeabi/build/Lib/test/test_socket.py", line 172, in setUp
ThreadedTCPSocketTest.setUp(self)
File "/home/pybot/buildarea-armeabi/2.5.klose-linux-armeabi/build/Lib/test/test_socket.py", line 26, in setUp
PORT = test_support.bind_port(self.serv, HOST, PORT)
File "/home/pybot/buildarea-armeabi/2.5.klose-linux-armeabi/build/Lib/test/test_support.py", line 101, in bind_port
sock.bind((host, port))
File "<string>", line 1, in bind
gaierror: (-2, 'Name or service not known')
======================================================================
ERROR: testUnbufferedRead (test.test_socket.FileObjectClassTestCase)
----------------------------------------------------------------------
Traceback (most recent call last):
File "/home/pybot/buildarea-armeabi/2.5.klose-linux-armeabi/build/Lib/test/test_socket.py", line 111, in _setUp
self.__setUp()
File "/home/pybot/buildarea-armeabi/2.5.klose-linux-armeabi/build/Lib/test/test_socket.py", line 703, in setUp
SocketConnectedTest.setUp(self)
File "/home/pybot/buildarea-armeabi/2.5.klose-linux-armeabi/build/Lib/test/test_socket.py", line 172, in setUp
ThreadedTCPSocketTest.setUp(self)
File "/home/pybot/buildarea-armeabi/2.5.klose-linux-armeabi/build/Lib/test/test_socket.py", line 26, in setUp
PORT = test_support.bind_port(self.serv, HOST, PORT)
File "/home/pybot/buildarea-armeabi/2.5.klose-linux-armeabi/build/Lib/test/test_support.py", line 101, in bind_port
sock.bind((host, port))
File "<string>", line 1, in bind
gaierror: (-2, 'Name or service not known')
======================================================================
ERROR: testClosedAttr (test.test_socket.UnbufferedFileObjectClassTestCase)
----------------------------------------------------------------------
Traceback (most recent call last):
File "/home/pybot/buildarea-armeabi/2.5.klose-linux-armeabi/build/Lib/test/test_socket.py", line 111, in _setUp
self.__setUp()
File "/home/pybot/buildarea-armeabi/2.5.klose-linux-armeabi/build/Lib/test/test_socket.py", line 703, in setUp
SocketConnectedTest.setUp(self)
File "/home/pybot/buildarea-armeabi/2.5.klose-linux-armeabi/build/Lib/test/test_socket.py", line 172, in setUp
ThreadedTCPSocketTest.setUp(self)
File "/home/pybot/buildarea-armeabi/2.5.klose-linux-armeabi/build/Lib/test/test_socket.py", line 26, in setUp
PORT = test_support.bind_port(self.serv, HOST, PORT)
File "/home/pybot/buildarea-armeabi/2.5.klose-linux-armeabi/build/Lib/test/test_support.py", line 101, in bind_port
sock.bind((host, port))
File "<string>", line 1, in bind
gaierror: (-2, 'Name or service not known')
======================================================================
ERROR: testFullRead (test.test_socket.UnbufferedFileObjectClassTestCase)
----------------------------------------------------------------------
Traceback (most recent call last):
File "/home/pybot/buildarea-armeabi/2.5.klose-linux-armeabi/build/Lib/test/test_socket.py", line 111, in _setUp
self.__setUp()
File "/home/pybot/buildarea-armeabi/2.5.klose-linux-armeabi/build/Lib/test/test_socket.py", line 703, in setUp
SocketConnectedTest.setUp(self)
File "/home/pybot/buildarea-armeabi/2.5.klose-linux-armeabi/build/Lib/test/test_socket.py", line 172, in setUp
ThreadedTCPSocketTest.setUp(self)
File "/home/pybot/buildarea-armeabi/2.5.klose-linux-armeabi/build/Lib/test/test_socket.py", line 26, in setUp
PORT = test_support.bind_port(self.serv, HOST, PORT)
File "/home/pybot/buildarea-armeabi/2.5.klose-linux-armeabi/build/Lib/test/test_support.py", line 101, in bind_port
sock.bind((host, port))
File "<string>", line 1, in bind
gaierror: (-2, 'Name or service not known')
======================================================================
ERROR: testReadline (test.test_socket.UnbufferedFileObjectClassTestCase)
----------------------------------------------------------------------
Traceback (most recent call last):
File "/home/pybot/buildarea-armeabi/2.5.klose-linux-armeabi/build/Lib/test/test_socket.py", line 111, in _setUp
self.__setUp()
File "/home/pybot/buildarea-armeabi/2.5.klose-linux-armeabi/build/Lib/test/test_socket.py", line 703, in setUp
SocketConnectedTest.setUp(self)
File "/home/pybot/buildarea-armeabi/2.5.klose-linux-armeabi/build/Lib/test/test_socket.py", line 172, in setUp
ThreadedTCPSocketTest.setUp(self)
File "/home/pybot/buildarea-armeabi/2.5.klose-linux-armeabi/build/Lib/test/test_socket.py", line 26, in setUp
PORT = test_support.bind_port(self.serv, HOST, PORT)
File "/home/pybot/buildarea-armeabi/2.5.klose-linux-armeabi/build/Lib/test/test_support.py", line 101, in bind_port
sock.bind((host, port))
File "<string>", line 1, in bind
gaierror: (-2, 'Name or service not known')
======================================================================
ERROR: testSmallRead (test.test_socket.UnbufferedFileObjectClassTestCase)
----------------------------------------------------------------------
Traceback (most recent call last):
File "/home/pybot/buildarea-armeabi/2.5.klose-linux-armeabi/build/Lib/test/test_socket.py", line 111, in _setUp
self.__setUp()
File "/home/pybot/buildarea-armeabi/2.5.klose-linux-armeabi/build/Lib/test/test_socket.py", line 703, in setUp
SocketConnectedTest.setUp(self)
File "/home/pybot/buildarea-armeabi/2.5.klose-linux-armeabi/build/Lib/test/test_socket.py", line 172, in setUp
ThreadedTCPSocketTest.setUp(self)
File "/home/pybot/buildarea-armeabi/2.5.klose-linux-armeabi/build/Lib/test/test_socket.py", line 26, in setUp
PORT = test_support.bind_port(self.serv, HOST, PORT)
File "/home/pybot/buildarea-armeabi/2.5.klose-linux-armeabi/build/Lib/test/test_support.py", line 101, in bind_port
sock.bind((host, port))
File "<string>", line 1, in bind
gaierror: (-2, 'Name or service not known')
======================================================================
ERROR: testUnbufferedRead (test.test_socket.UnbufferedFileObjectClassTestCase)
----------------------------------------------------------------------
Traceback (most recent call last):
File "/home/pybot/buildarea-armeabi/2.5.klose-linux-armeabi/build/Lib/test/test_socket.py", line 111, in _setUp
self.__setUp()
File "/home/pybot/buildarea-armeabi/2.5.klose-linux-armeabi/build/Lib/test/test_socket.py", line 703, in setUp
SocketConnectedTest.setUp(self)
File "/home/pybot/buildarea-armeabi/2.5.klose-linux-armeabi/build/Lib/test/test_socket.py", line 172, in setUp
ThreadedTCPSocketTest.setUp(self)
File "/home/pybot/buildarea-armeabi/2.5.klose-linux-armeabi/build/Lib/test/test_socket.py", line 26, in setUp
PORT = test_support.bind_port(self.serv, HOST, PORT)
File "/home/pybot/buildarea-armeabi/2.5.klose-linux-armeabi/build/Lib/test/test_support.py", line 101, in bind_port
sock.bind((host, port))
File "<string>", line 1, in bind
gaierror: (-2, 'Name or service not known')
======================================================================
ERROR: testUnbufferedReadline (test.test_socket.UnbufferedFileObjectClassTestCase)
----------------------------------------------------------------------
Traceback (most recent call last):
File "/home/pybot/buildarea-armeabi/2.5.klose-linux-armeabi/build/Lib/test/test_socket.py", line 111, in _setUp
self.__setUp()
File "/home/pybot/buildarea-armeabi/2.5.klose-linux-armeabi/build/Lib/test/test_socket.py", line 703, in setUp
SocketConnectedTest.setUp(self)
File "/home/pybot/buildarea-armeabi/2.5.klose-linux-armeabi/build/Lib/test/test_socket.py", line 172, in setUp
ThreadedTCPSocketTest.setUp(self)
File "/home/pybot/buildarea-armeabi/2.5.klose-linux-armeabi/build/Lib/test/test_socket.py", line 26, in setUp
PORT = test_support.bind_port(self.serv, HOST, PORT)
File "/home/pybot/buildarea-armeabi/2.5.klose-linux-armeabi/build/Lib/test/test_support.py", line 101, in bind_port
sock.bind((host, port))
File "<string>", line 1, in bind
gaierror: (-2, 'Name or service not known')
======================================================================
ERROR: testClosedAttr (test.test_socket.LineBufferedFileObjectClassTestCase)
----------------------------------------------------------------------
Traceback (most recent call last):
File "/home/pybot/buildarea-armeabi/2.5.klose-linux-armeabi/build/Lib/test/test_socket.py", line 111, in _setUp
self.__setUp()
File "/home/pybot/buildarea-armeabi/2.5.klose-linux-armeabi/build/Lib/test/test_socket.py", line 703, in setUp
SocketConnectedTest.setUp(self)
File "/home/pybot/buildarea-armeabi/2.5.klose-linux-armeabi/build/Lib/test/test_socket.py", line 172, in setUp
ThreadedTCPSocketTest.setUp(self)
File "/home/pybot/buildarea-armeabi/2.5.klose-linux-armeabi/build/Lib/test/test_socket.py", line 26, in setUp
PORT = test_support.bind_port(self.serv, HOST, PORT)
File "/home/pybot/buildarea-armeabi/2.5.klose-linux-armeabi/build/Lib/test/test_support.py", line 101, in bind_port
sock.bind((host, port))
File "<string>", line 1, in bind
gaierror: (-2, 'Name or service not known')
======================================================================
ERROR: testFullRead (test.test_socket.LineBufferedFileObjectClassTestCase)
----------------------------------------------------------------------
Traceback (most recent call last):
File "/home/pybot/buildarea-armeabi/2.5.klose-linux-armeabi/build/Lib/test/test_socket.py", line 111, in _setUp
self.__setUp()
File "/home/pybot/buildarea-armeabi/2.5.klose-linux-armeabi/build/Lib/test/test_socket.py", line 703, in setUp
SocketConnectedTest.setUp(self)
File "/home/pybot/buildarea-armeabi/2.5.klose-linux-armeabi/build/Lib/test/test_socket.py", line 172, in setUp
ThreadedTCPSocketTest.setUp(self)
File "/home/pybot/buildarea-armeabi/2.5.klose-linux-armeabi/build/Lib/test/test_socket.py", line 26, in setUp
PORT = test_support.bind_port(self.serv, HOST, PORT)
File "/home/pybot/buildarea-armeabi/2.5.klose-linux-armeabi/build/Lib/test/test_support.py", line 101, in bind_port
sock.bind((host, port))
File "<string>", line 1, in bind
gaierror: (-2, 'Name or service not known')
======================================================================
ERROR: testReadline (test.test_socket.LineBufferedFileObjectClassTestCase)
----------------------------------------------------------------------
Traceback (most recent call last):
File "/home/pybot/buildarea-armeabi/2.5.klose-linux-armeabi/build/Lib/test/test_socket.py", line 111, in _setUp
self.__setUp()
File "/home/pybot/buildarea-armeabi/2.5.klose-linux-armeabi/build/Lib/test/test_socket.py", line 703, in setUp
SocketConnectedTest.setUp(self)
File "/home/pybot/buildarea-armeabi/2.5.klose-linux-armeabi/build/Lib/test/test_socket.py", line 172, in setUp
ThreadedTCPSocketTest.setUp(self)
File "/home/pybot/buildarea-armeabi/2.5.klose-linux-armeabi/build/Lib/test/test_socket.py", line 26, in setUp
PORT = test_support.bind_port(self.serv, HOST, PORT)
File "/home/pybot/buildarea-armeabi/2.5.klose-linux-armeabi/build/Lib/test/test_support.py", line 101, in bind_port
sock.bind((host, port))
File "<string>", line 1, in bind
gaierror: (-2, 'Name or service not known')
======================================================================
ERROR: testSmallRead (test.test_socket.LineBufferedFileObjectClassTestCase)
----------------------------------------------------------------------
Traceback (most recent call last):
File "/home/pybot/buildarea-armeabi/2.5.klose-linux-armeabi/build/Lib/test/test_socket.py", line 111, in _setUp
self.__setUp()
File "/home/pybot/buildarea-armeabi/2.5.klose-linux-armeabi/build/Lib/test/test_socket.py", line 703, in setUp
SocketConnectedTest.setUp(self)
File "/home/pybot/buildarea-armeabi/2.5.klose-linux-armeabi/build/Lib/test/test_socket.py", line 172, in setUp
ThreadedTCPSocketTest.setUp(self)
File "/home/pybot/buildarea-armeabi/2.5.klose-linux-armeabi/build/Lib/test/test_socket.py", line 26, in setUp
PORT = test_support.bind_port(self.serv, HOST, PORT)
File "/home/pybot/buildarea-armeabi/2.5.klose-linux-armeabi/build/Lib/test/test_support.py", line 101, in bind_port
sock.bind((host, port))
File "<string>", line 1, in bind
gaierror: (-2, 'Name or service not known')
======================================================================
ERROR: testUnbufferedRead (test.test_socket.LineBufferedFileObjectClassTestCase)
----------------------------------------------------------------------
Traceback (most recent call last):
File "/home/pybot/buildarea-armeabi/2.5.klose-linux-armeabi/build/Lib/test/test_socket.py", line 111, in _setUp
self.__setUp()
File "/home/pybot/buildarea-armeabi/2.5.klose-linux-armeabi/build/Lib/test/test_socket.py", line 703, in setUp
SocketConnectedTest.setUp(self)
File "/home/pybot/buildarea-armeabi/2.5.klose-linux-armeabi/build/Lib/test/test_socket.py", line 172, in setUp
ThreadedTCPSocketTest.setUp(self)
File "/home/pybot/buildarea-armeabi/2.5.klose-linux-armeabi/build/Lib/test/test_socket.py", line 26, in setUp
PORT = test_support.bind_port(self.serv, HOST, PORT)
File "/home/pybot/buildarea-armeabi/2.5.klose-linux-armeabi/build/Lib/test/test_support.py", line 101, in bind_port
sock.bind((host, port))
File "<string>", line 1, in bind
gaierror: (-2, 'Name or service not known')
======================================================================
ERROR: testClosedAttr (test.test_socket.SmallBufferedFileObjectClassTestCase)
----------------------------------------------------------------------
Traceback (most recent call last):
File "/home/pybot/buildarea-armeabi/2.5.klose-linux-armeabi/build/Lib/test/test_socket.py", line 111, in _setUp
self.__setUp()
File "/home/pybot/buildarea-armeabi/2.5.klose-linux-armeabi/build/Lib/test/test_socket.py", line 703, in setUp
SocketConnectedTest.setUp(self)
File "/home/pybot/buildarea-armeabi/2.5.klose-linux-armeabi/build/Lib/test/test_socket.py", line 172, in setUp
ThreadedTCPSocketTest.setUp(self)
File "/home/pybot/buildarea-armeabi/2.5.klose-linux-armeabi/build/Lib/test/test_socket.py", line 26, in setUp
PORT = test_support.bind_port(self.serv, HOST, PORT)
File "/home/pybot/buildarea-armeabi/2.5.klose-linux-armeabi/build/Lib/test/test_support.py", line 101, in bind_port
sock.bind((host, port))
File "<string>", line 1, in bind
gaierror: (-2, 'Name or service not known')
======================================================================
ERROR: testFullRead (test.test_socket.SmallBufferedFileObjectClassTestCase)
----------------------------------------------------------------------
Traceback (most recent call last):
File "/home/pybot/buildarea-armeabi/2.5.klose-linux-armeabi/build/Lib/test/test_socket.py", line 111, in _setUp
self.__setUp()
File "/home/pybot/buildarea-armeabi/2.5.klose-linux-armeabi/build/Lib/test/test_socket.py", line 703, in setUp
SocketConnectedTest.setUp(self)
File "/home/pybot/buildarea-armeabi/2.5.klose-linux-armeabi/build/Lib/test/test_socket.py", line 172, in setUp
ThreadedTCPSocketTest.setUp(self)
File "/home/pybot/buildarea-armeabi/2.5.klose-linux-armeabi/build/Lib/test/test_socket.py", line 26, in setUp
PORT = test_support.bind_port(self.serv, HOST, PORT)
File "/home/pybot/buildarea-armeabi/2.5.klose-linux-armeabi/build/Lib/test/test_support.py", line 101, in bind_port
sock.bind((host, port))
File "<string>", line 1, in bind
gaierror: (-2, 'Name or service not known')
======================================================================
ERROR: testReadline (test.test_socket.SmallBufferedFileObjectClassTestCase)
----------------------------------------------------------------------
Traceback (most recent call last):
File "/home/pybot/buildarea-armeabi/2.5.klose-linux-armeabi/build/Lib/test/test_socket.py", line 111, in _setUp
self.__setUp()
File "/home/pybot/buildarea-armeabi/2.5.klose-linux-armeabi/build/Lib/test/test_socket.py", line 703, in setUp
SocketConnectedTest.setUp(self)
File "/home/pybot/buildarea-armeabi/2.5.klose-linux-armeabi/build/Lib/test/test_socket.py", line 172, in setUp
ThreadedTCPSocketTest.setUp(self)
File "/home/pybot/buildarea-armeabi/2.5.klose-linux-armeabi/build/Lib/test/test_socket.py", line 26, in setUp
PORT = test_support.bind_port(self.serv, HOST, PORT)
File "/home/pybot/buildarea-armeabi/2.5.klose-linux-armeabi/build/Lib/test/test_support.py", line 101, in bind_port
sock.bind((host, port))
File "<string>", line 1, in bind
gaierror: (-2, 'Name or service not known')
======================================================================
ERROR: testSmallRead (test.test_socket.SmallBufferedFileObjectClassTestCase)
----------------------------------------------------------------------
Traceback (most recent call last):
File "/home/pybot/buildarea-armeabi/2.5.klose-linux-armeabi/build/Lib/test/test_socket.py", line 111, in _setUp
self.__setUp()
File "/home/pybot/buildarea-armeabi/2.5.klose-linux-armeabi/build/Lib/test/test_socket.py", line 703, in setUp
SocketConnectedTest.setUp(self)
File "/home/pybot/buildarea-armeabi/2.5.klose-linux-armeabi/build/Lib/test/test_socket.py", line 172, in setUp
ThreadedTCPSocketTest.setUp(self)
File "/home/pybot/buildarea-armeabi/2.5.klose-linux-armeabi/build/Lib/test/test_socket.py", line 26, in setUp
PORT = test_support.bind_port(self.serv, HOST, PORT)
File "/home/pybot/buildarea-armeabi/2.5.klose-linux-armeabi/build/Lib/test/test_support.py", line 101, in bind_port
sock.bind((host, port))
File "<string>", line 1, in bind
gaierror: (-2, 'Name or service not known')
======================================================================
ERROR: testUnbufferedRead (test.test_socket.SmallBufferedFileObjectClassTestCase)
----------------------------------------------------------------------
Traceback (most recent call last):
File "/home/pybot/buildarea-armeabi/2.5.klose-linux-armeabi/build/Lib/test/test_socket.py", line 111, in _setUp
self.__setUp()
File "/home/pybot/buildarea-armeabi/2.5.klose-linux-armeabi/build/Lib/test/test_socket.py", line 703, in setUp
SocketConnectedTest.setUp(self)
File "/home/pybot/buildarea-armeabi/2.5.klose-linux-armeabi/build/Lib/test/test_socket.py", line 172, in setUp
ThreadedTCPSocketTest.setUp(self)
File "/home/pybot/buildarea-armeabi/2.5.klose-linux-armeabi/build/Lib/test/test_socket.py", line 26, in setUp
PORT = test_support.bind_port(self.serv, HOST, PORT)
File "/home/pybot/buildarea-armeabi/2.5.klose-linux-armeabi/build/Lib/test/test_support.py", line 101, in bind_port
sock.bind((host, port))
File "<string>", line 1, in bind
gaierror: (-2, 'Name or service not known')
Traceback (most recent call last):
File "./Lib/test/regrtest.py", line 557, in runtest_inner
indirect_test()
File "/home/pybot/buildarea-armeabi/2.5.klose-linux-armeabi/build/Lib/test/test_socket_ssl.py", line 129, in test_main
test_rude_shutdown()
File "/home/pybot/buildarea-armeabi/2.5.klose-linux-armeabi/build/Lib/test/test_socket_ssl.py", line 123, in test_rude_shutdown
connector()
File "/home/pybot/buildarea-armeabi/2.5.klose-linux-armeabi/build/Lib/test/test_socket_ssl.py", line 111, in connector
s.connect(('localhost', PORT[0]))
File "<string>", line 1, in connect
gaierror: (-2, 'Name or service not known')
Traceback (most recent call last):
File "/home/pybot/buildarea-armeabi/2.5.klose-linux-armeabi/build/Lib/threading.py", line 460, in __bootstrap
self.run()
File "/home/pybot/buildarea-armeabi/2.5.klose-linux-armeabi/build/Lib/test/test_socketserver.py", line 81, in run
svr = svrcls(self.__addr, self.__hdlrcls)
File "/home/pybot/buildarea-armeabi/2.5.klose-linux-armeabi/build/Lib/SocketServer.py", line 330, in __init__
self.server_bind()
File "/home/pybot/buildarea-armeabi/2.5.klose-linux-armeabi/build/Lib/test/test_socketserver.py", line 159, in server_bind
TCPServer.server_bind(self)
File "/home/pybot/buildarea-armeabi/2.5.klose-linux-armeabi/build/Lib/SocketServer.py", line 341, in server_bind
self.socket.bind(self.server_address)
File "<string>", line 1, in bind
gaierror: (-2, 'Name or service not known')
Traceback (most recent call last):
File "./Lib/test/regrtest.py", line 557, in runtest_inner
indirect_test()
File "/home/pybot/buildarea-armeabi/2.5.klose-linux-armeabi/build/Lib/test/test_socketserver.py", line 212, in test_main
testall()
File "/home/pybot/buildarea-armeabi/2.5.klose-linux-armeabi/build/Lib/test/test_socketserver.py", line 195, in testall
testloop(socket.AF_INET, tcpservers, MyStreamHandler, teststream)
File "/home/pybot/buildarea-armeabi/2.5.klose-linux-armeabi/build/Lib/test/test_socketserver.py", line 144, in testloop
testfunc(proto, addr)
File "/home/pybot/buildarea-armeabi/2.5.klose-linux-armeabi/build/Lib/test/test_socketserver.py", line 62, in teststream
s.connect(addr)
File "<string>", line 1, in connect
gaierror: (-2, 'Name or service not known')
======================================================================
ERROR: test_file (test.test_urllib2.HandlerTests)
----------------------------------------------------------------------
Traceback (most recent call last):
File "/home/pybot/buildarea-armeabi/2.5.klose-linux-armeabi/build/Lib/test/test_urllib2.py", line 600, in test_file
"file://%s%s" % (socket.gethostbyname('localhost'), urlpath),
gaierror: (-2, 'Name or service not known')
======================================================================
ERROR: test_ftp (test.test_urllib2.HandlerTests)
----------------------------------------------------------------------
Traceback (most recent call last):
File "/home/pybot/buildarea-armeabi/2.5.klose-linux-armeabi/build/Lib/test/test_urllib2.py", line 577, in test_ftp
r = h.ftp_open(Request(url))
File "/home/pybot/buildarea-armeabi/2.5.klose-linux-armeabi/build/Lib/urllib2.py", line 1264, in ftp_open
raise URLError(msg)
URLError: <urlopen error (-2, 'Name or service not known')>
make: *** [buildbottest] Error 1
sincerely,
-The Buildbot
1
0
The Buildbot has detected a new failure of alpha Tru64 5.1 2.5.
Full details are available at:
http://www.python.org/dev/buildbot/all/alpha%20Tru64%205.1%202.5/builds/325
Buildbot URL: http://www.python.org/dev/buildbot/all/
Buildslave for this Build: norwitz-tru64
Build Reason:
Build Source Stamp: [branch branches/release25-maint] HEAD
Blamelist: gregory.p.smith
BUILD FAILED: failed test
Excerpt from the test logfile:
2 tests failed:
test_signal test_socket
Traceback (most recent call last):
File "./Lib/test/regrtest.py", line 549, in runtest_inner
the_package = __import__(abstest, globals(), locals(), [])
File "/net/taipan/scratch1/nnorwitz/python/2.5.norwitz-tru64/build/Lib/test/test_signal.py", line 143, in <module>
print "KeyboardInterrupt (the alarm() went off)"
File "/net/taipan/scratch1/nnorwitz/python/2.5.norwitz-tru64/build/Lib/test/test_signal.py", line 49, in handlerB
raise HandlerBCalled, args
HandlerBCalled: (30, <frame object at 0x144682630>)
sincerely,
-The Buildbot
1
0
The Buildbot has detected a new failure of S-390 Debian trunk.
Full details are available at:
http://www.python.org/dev/buildbot/all/S-390%20Debian%20trunk/builds/1246
Buildbot URL: http://www.python.org/dev/buildbot/all/
Buildslave for this Build: klose-debian-s390
Build Reason:
Build Source Stamp: [branch trunk] HEAD
Blamelist: gregory.p.smith
BUILD FAILED: failed test
Excerpt from the test logfile:
1 test failed:
test_ctypes
======================================================================
FAIL: test_longdouble (ctypes.test.test_callbacks.Callbacks)
----------------------------------------------------------------------
Traceback (most recent call last):
File "/home/pybot/buildarea/trunk.klose-debian-s390/build/Lib/ctypes/test/test_callbacks.py", line 81, in test_longdouble
self.check_type(c_longdouble, 3.14)
File "/home/pybot/buildarea/trunk.klose-debian-s390/build/Lib/ctypes/test/test_callbacks.py", line 22, in check_type
self.failUnlessEqual(self.got_args, (arg,))
AssertionError: (-inf,) != (3.1400000000000001,)
make: *** [buildbottest] Error 1
sincerely,
-The Buildbot
1
0
The Buildbot has detected a new failure of x86 gentoo trunk.
Full details are available at:
http://www.python.org/dev/buildbot/all/x86%20gentoo%20trunk/builds/2520
Buildbot URL: http://www.python.org/dev/buildbot/all/
Buildslave for this Build: norwitz-x86
Build Reason:
Build Source Stamp: [branch trunk] HEAD
Blamelist: gregory.p.smith
BUILD FAILED: failed test
Excerpt from the test logfile:
Traceback (most recent call last):
File "/home/buildslave/python-trunk/trunk.norwitz-x86/build/Lib/threading.py", line 486, in __bootstrap_inner
self.run()
File "/home/buildslave/python-trunk/trunk.norwitz-x86/build/Lib/test/test_asynchat.py", line 22, in run
PORT = test_support.bind_port(sock, HOST, PORT)
File "/home/buildslave/python-trunk/trunk.norwitz-x86/build/Lib/test/test_support.py", line 113, in bind_port
raise TestFailed('unable to find port to listen on')
TestFailed: unable to find port to listen on
Traceback (most recent call last):
File "/home/buildslave/python-trunk/trunk.norwitz-x86/build/Lib/threading.py", line 486, in __bootstrap_inner
self.run()
File "/home/buildslave/python-trunk/trunk.norwitz-x86/build/Lib/test/test_asynchat.py", line 22, in run
PORT = test_support.bind_port(sock, HOST, PORT)
File "/home/buildslave/python-trunk/trunk.norwitz-x86/build/Lib/test/test_support.py", line 113, in bind_port
raise TestFailed('unable to find port to listen on')
TestFailed: unable to find port to listen on
Traceback (most recent call last):
File "/home/buildslave/python-trunk/trunk.norwitz-x86/build/Lib/threading.py", line 486, in __bootstrap_inner
self.run()
File "/home/buildslave/python-trunk/trunk.norwitz-x86/build/Lib/test/test_asynchat.py", line 22, in run
PORT = test_support.bind_port(sock, HOST, PORT)
File "/home/buildslave/python-trunk/trunk.norwitz-x86/build/Lib/test/test_support.py", line 113, in bind_port
raise TestFailed('unable to find port to listen on')
TestFailed: unable to find port to listen on
Traceback (most recent call last):
File "/home/buildslave/python-trunk/trunk.norwitz-x86/build/Lib/threading.py", line 486, in __bootstrap_inner
self.run()
File "/home/buildslave/python-trunk/trunk.norwitz-x86/build/Lib/test/test_asynchat.py", line 22, in run
PORT = test_support.bind_port(sock, HOST, PORT)
File "/home/buildslave/python-trunk/trunk.norwitz-x86/build/Lib/test/test_support.py", line 113, in bind_port
raise TestFailed('unable to find port to listen on')
TestFailed: unable to find port to listen on
Traceback (most recent call last):
File "/home/buildslave/python-trunk/trunk.norwitz-x86/build/Lib/threading.py", line 486, in __bootstrap_inner
self.run()
File "/home/buildslave/python-trunk/trunk.norwitz-x86/build/Lib/test/test_asynchat.py", line 22, in run
PORT = test_support.bind_port(sock, HOST, PORT)
File "/home/buildslave/python-trunk/trunk.norwitz-x86/build/Lib/test/test_support.py", line 113, in bind_port
raise TestFailed('unable to find port to listen on')
TestFailed: unable to find port to listen on
Traceback (most recent call last):
File "/home/buildslave/python-trunk/trunk.norwitz-x86/build/Lib/threading.py", line 486, in __bootstrap_inner
self.run()
File "/home/buildslave/python-trunk/trunk.norwitz-x86/build/Lib/test/test_asynchat.py", line 22, in run
PORT = test_support.bind_port(sock, HOST, PORT)
File "/home/buildslave/python-trunk/trunk.norwitz-x86/build/Lib/test/test_support.py", line 113, in bind_port
raise TestFailed('unable to find port to listen on')
TestFailed: unable to find port to listen on
Traceback (most recent call last):
File "/home/buildslave/python-trunk/trunk.norwitz-x86/build/Lib/threading.py", line 486, in __bootstrap_inner
self.run()
File "/home/buildslave/python-trunk/trunk.norwitz-x86/build/Lib/test/test_asynchat.py", line 22, in run
PORT = test_support.bind_port(sock, HOST, PORT)
File "/home/buildslave/python-trunk/trunk.norwitz-x86/build/Lib/test/test_support.py", line 113, in bind_port
raise TestFailed('unable to find port to listen on')
TestFailed: unable to find port to listen on
Traceback (most recent call last):
File "/home/buildslave/python-trunk/trunk.norwitz-x86/build/Lib/threading.py", line 486, in __bootstrap_inner
self.run()
File "/home/buildslave/python-trunk/trunk.norwitz-x86/build/Lib/test/test_asynchat.py", line 22, in run
PORT = test_support.bind_port(sock, HOST, PORT)
File "/home/buildslave/python-trunk/trunk.norwitz-x86/build/Lib/test/test_support.py", line 113, in bind_port
raise TestFailed('unable to find port to listen on')
TestFailed: unable to find port to listen on
1 test failed:
test_asynchat
sincerely,
-The Buildbot
1
0
The Buildbot has detected a new failure of x86 XP-3 trunk.
Full details are available at:
http://www.python.org/dev/buildbot/all/x86%20XP-3%20trunk/builds/290
Buildbot URL: http://www.python.org/dev/buildbot/all/
Buildslave for this Build: heller-windows
Build Reason:
Build Source Stamp: [branch trunk] HEAD
Blamelist: gregory.p.smith
BUILD FAILED: failed test
Excerpt from the test logfile:
1 test failed:
test_bufio
sincerely,
-The Buildbot
1
0
Oct. 6, 2007
Author: gregory.p.smith
Date: Sat Oct 6 18:05:18 2007
New Revision: 58350
Modified:
python/branches/release25-maint/Modules/_bsddb.c
Log:
Backport rev 58343: fix DBSequence.get_key() to not crash/fail/etc.
Modified: python/branches/release25-maint/Modules/_bsddb.c
==============================================================================
--- python/branches/release25-maint/Modules/_bsddb.c (original)
+++ python/branches/release25-maint/Modules/_bsddb.c Sat Oct 6 18:05:18 2007
@@ -4883,14 +4883,20 @@
{
int err;
DBT key;
+ PyObject *retval;
+ key.flags = DB_DBT_MALLOC;
CHECK_SEQUENCE_NOT_CLOSED(self)
MYDB_BEGIN_ALLOW_THREADS
err = self->sequence->get_key(self->sequence, &key);
MYDB_END_ALLOW_THREADS
+ if (!err)
+ retval = PyString_FromStringAndSize(key.data, key.size);
+
+ FREE_DBT(key);
RETURN_IF_ERR();
- return PyString_FromStringAndSize(key.data, key.size);
+ return retval;
}
static PyObject*
1
0
The Buildbot has detected a new failure of amd64 XP trunk.
Full details are available at:
http://www.python.org/dev/buildbot/all/amd64%20XP%20trunk/builds/249
Buildbot URL: http://www.python.org/dev/buildbot/all/
Buildslave for this Build: heller-windows-amd64
Build Reason:
Build Source Stamp: [branch trunk] HEAD
Blamelist: gregory.p.smith
BUILD FAILED: failed compile
sincerely,
-The Buildbot
1
0