Python-checkins
Threads by month
- ----- 2026 -----
- October
- September
- August
- July
- June
- May
- April
- March
- February
- January
- ----- 2025 -----
- December
- November
- October
- September
- August
- July
- June
- May
- April
- March
- February
- January
- ----- 2024 -----
- December
- November
- October
- September
- August
- July
- June
- May
- April
- March
- February
- January
- ----- 2023 -----
- December
- November
- October
- September
- August
- July
- June
- May
- April
- March
- February
- January
- ----- 2022 -----
- December
- November
- October
- September
- August
- July
- June
- May
- April
- March
- February
- January
- ----- 2021 -----
- December
- November
- October
- September
- August
- July
- June
- May
- April
- March
- February
- January
- ----- 2020 -----
- December
- November
- October
- September
- August
- July
- June
- May
- April
- March
- February
- January
- ----- 2019 -----
- December
- November
- October
- September
- August
- July
- June
- May
- April
- March
- February
- January
- ----- 2018 -----
- December
- November
- October
- September
- August
- July
- June
- May
- April
- March
- February
- January
- ----- 2017 -----
- December
- November
- October
- September
- August
- July
- June
- May
- April
- March
- February
- January
- ----- 2016 -----
- December
- November
- October
- September
- August
- July
- June
- May
- April
- March
- February
- January
- ----- 2015 -----
- December
- November
- October
- September
- August
- July
- June
- May
- April
- March
- February
- January
- ----- 2014 -----
- December
- November
- October
- September
- August
- July
- June
- May
- April
- March
- February
- January
- ----- 2013 -----
- December
- November
- October
- September
- August
- July
- June
- May
- April
- March
- February
- January
- ----- 2012 -----
- December
- November
- October
- September
- August
- July
- June
- May
- April
- March
- February
- January
- ----- 2011 -----
- December
- November
- October
- September
- August
- July
- June
- May
- April
- March
- February
- January
- ----- 2010 -----
- December
- November
- October
- September
- August
- July
- June
- May
- April
- March
- February
- January
- ----- 2009 -----
- December
- November
- October
- September
- August
- July
- June
- May
- April
- March
- February
- January
- ----- 2008 -----
- December
- November
- October
- September
- August
- July
- June
- May
- April
- March
- February
- January
- ----- 2007 -----
- December
- November
- October
- September
- August
- July
- June
- May
- April
- March
- February
- January
- ----- 2006 -----
- December
- November
- October
- September
- August
- July
- June
- May
- April
- March
- February
- January
- ----- 2005 -----
- December
- November
- October
- September
- August
- July
- June
- May
- April
- March
- February
- January
- ----- 2004 -----
- December
- November
- October
- September
- August
- July
- June
- May
- April
- March
- February
- January
- ----- 2003 -----
- December
- November
- October
- September
- August
September 2007
- 11 participants
- 485 discussions
r58259 - in sandbox/branches/setuptools-0.6: setuptools.txt setuptools/command/egg_info.py
by phillip.eby Sept. 26, 2007
by phillip.eby Sept. 26, 2007
Sept. 26, 2007
Author: phillip.eby
Date: Wed Sep 26 19:07:52 2007
New Revision: 58259
Modified:
sandbox/branches/setuptools-0.6/setuptools.txt
sandbox/branches/setuptools-0.6/setuptools/command/egg_info.py
Log:
Fixed a missing files problem when using Windows source distributions on
non-Windows platforms, due to distutils not handling manifest file line
endings correctly. (backport from trunk)
Modified: sandbox/branches/setuptools-0.6/setuptools.txt
==============================================================================
--- sandbox/branches/setuptools-0.6/setuptools.txt (original)
+++ sandbox/branches/setuptools-0.6/setuptools.txt Wed Sep 26 19:07:52 2007
@@ -2611,6 +2611,11 @@
Release Notes/Change History
----------------------------
+0.6final
+ * Fixed a missing files problem when using Windows source distributions on
+ non-Windows platforms, due to distutils not handling manifest file line
+ endings correctly.
+
0.6c7
* Fixed ``distutils.filelist.findall()`` crashing on broken symlinks, and
``egg_info`` command failing on new, uncommitted SVN directories.
Modified: sandbox/branches/setuptools-0.6/setuptools/command/egg_info.py
==============================================================================
--- sandbox/branches/setuptools-0.6/setuptools/command/egg_info.py (original)
+++ sandbox/branches/setuptools-0.6/setuptools/command/egg_info.py Wed Sep 26 19:07:52 2007
@@ -8,7 +8,6 @@
from distutils.errors import *
from distutils import log
from setuptools.command.sdist import sdist
-from distutils import file_util
from distutils.util import convert_path
from distutils.filelist import FileList
from pkg_resources import parse_requirements, safe_name, parse_version, \
@@ -39,6 +38,7 @@
+
def initialize_options(self):
self.egg_name = None
self.egg_version = None
@@ -271,6 +271,8 @@
"""File list that accepts only existing, platform-independent paths"""
def append(self, item):
+ if item.endswith('\r'): # Fix older sdists built on Windows
+ item = item[:-1]
path = convert_path(item)
if os.path.exists(path):
self.files.append(path)
@@ -283,8 +285,6 @@
-
-
class manifest_maker(sdist):
template = "MANIFEST.in"
@@ -319,7 +319,7 @@
files = self.filelist.files
if os.sep!='/':
files = [f.replace(os.sep,'/') for f in files]
- self.execute(file_util.write_file, (self.manifest, files),
+ self.execute(write_file, (self.manifest, files),
"writing manifest file '%s'" % self.manifest)
def warn(self, msg): # suppress missing-file warnings from sdist
@@ -347,13 +347,13 @@
self.filelist.exclude_pattern(sep+r'(RCS|CVS|\.svn)'+sep, is_regex=1)
-
-
-
-
-
-
-
+def write_file (filename, contents):
+ """Create a file with the specified name and write 'contents' (a
+ sequence of strings without line terminators) to it.
+ """
+ f = open(filename, "wb") # always write POSIX-style manifest
+ f.write("\n".join(contents))
+ f.close()
1
0
r58258 - in sandbox/branches/setuptools-0.6: ez_setup.py release.sh setup.py setuptools/__init__.py version.dat
by phillip.eby Sept. 26, 2007
by phillip.eby Sept. 26, 2007
Sept. 26, 2007
Author: phillip.eby
Date: Wed Sep 26 19:04:48 2007
New Revision: 58258
Modified:
sandbox/branches/setuptools-0.6/ez_setup.py
sandbox/branches/setuptools-0.6/release.sh
sandbox/branches/setuptools-0.6/setup.py
sandbox/branches/setuptools-0.6/setuptools/__init__.py
sandbox/branches/setuptools-0.6/version.dat
Log:
Bump version.
Modified: sandbox/branches/setuptools-0.6/ez_setup.py
==============================================================================
--- sandbox/branches/setuptools-0.6/ez_setup.py (original)
+++ sandbox/branches/setuptools-0.6/ez_setup.py Wed Sep 26 19:04:48 2007
@@ -14,7 +14,7 @@
This file can also be run as a script to install or upgrade setuptools.
"""
import sys
-DEFAULT_VERSION = "0.6c7"
+DEFAULT_VERSION = "0.6c8"
DEFAULT_URL = "http://pypi.python.org/packages/%s/s/setuptools/" % sys.version[:3]
md5_data = {
Modified: sandbox/branches/setuptools-0.6/release.sh
==============================================================================
--- sandbox/branches/setuptools-0.6/release.sh (original)
+++ sandbox/branches/setuptools-0.6/release.sh Wed Sep 26 19:04:48 2007
@@ -7,7 +7,7 @@
# If your initials aren't PJE, don't run it. :)
#
-export VERSION="0.6c7"
+export VERSION="0.6c8"
python2.3 setup.py -q release source --target-version=2.3 upload && \
python2.4 setup.py -q release binary --target-version=2.4 upload && \
Modified: sandbox/branches/setuptools-0.6/setup.py
==============================================================================
--- sandbox/branches/setuptools-0.6/setup.py (original)
+++ sandbox/branches/setuptools-0.6/setup.py Wed Sep 26 19:04:48 2007
@@ -7,7 +7,7 @@
execfile(convert_path('setuptools/command/__init__.py'), d)
SETUP_COMMANDS = d['__all__']
-VERSION = "0.6c7"
+VERSION = "0.6c8"
from setuptools import setup, find_packages
import sys
Modified: sandbox/branches/setuptools-0.6/setuptools/__init__.py
==============================================================================
--- sandbox/branches/setuptools-0.6/setuptools/__init__.py (original)
+++ sandbox/branches/setuptools-0.6/setuptools/__init__.py Wed Sep 26 19:04:48 2007
@@ -7,7 +7,7 @@
from distutils.util import convert_path
import os.path
-__version__ = '0.6c7'
+__version__ = '0.6c8'
__all__ = [
'setup', 'Distribution', 'Feature', 'Command', 'Extension', 'Require',
'find_packages'
Modified: sandbox/branches/setuptools-0.6/version.dat
==============================================================================
--- sandbox/branches/setuptools-0.6/version.dat (original)
+++ sandbox/branches/setuptools-0.6/version.dat Wed Sep 26 19:04:48 2007
@@ -1,6 +1,6 @@
[setuptools]
status = 'release candidate'
major = 0
-build = 7
+build = 8
minor = 6
1
0
Sept. 26, 2007
Author: phillip.eby
Date: Wed Sep 26 19:03:39 2007
New Revision: 58257
Modified:
sandbox/trunk/setuptools/setuptools/command/egg_info.py
Log:
Fix cross-platform line-end problem with SOURCES.txt: distutils
doesn't expect manifest files to be shipped across platforms.
Modified: sandbox/trunk/setuptools/setuptools/command/egg_info.py
==============================================================================
--- sandbox/trunk/setuptools/setuptools/command/egg_info.py (original)
+++ sandbox/trunk/setuptools/setuptools/command/egg_info.py Wed Sep 26 19:03:39 2007
@@ -8,7 +8,6 @@
from distutils.errors import *
from distutils import log
from setuptools.command.sdist import sdist
-from distutils import file_util
from distutils.util import convert_path
from distutils.filelist import FileList
from pkg_resources import parse_requirements, safe_name, parse_version, \
@@ -39,6 +38,7 @@
+
def initialize_options(self):
self.egg_name = None
self.egg_version = None
@@ -271,6 +271,8 @@
"""File list that accepts only existing, platform-independent paths"""
def append(self, item):
+ if item.endswith('\r'): # Fix older sdists built on Windows
+ item = item[:-1]
path = convert_path(item)
if os.path.exists(path):
self.files.append(path)
@@ -283,8 +285,6 @@
-
-
class manifest_maker(sdist):
template = "MANIFEST.in"
@@ -319,7 +319,7 @@
files = self.filelist.files
if os.sep!='/':
files = [f.replace(os.sep,'/') for f in files]
- self.execute(file_util.write_file, (self.manifest, files),
+ self.execute(write_file, (self.manifest, files),
"writing manifest file '%s'" % self.manifest)
def warn(self, msg): # suppress missing-file warnings from sdist
@@ -347,13 +347,13 @@
self.filelist.exclude_pattern(sep+r'(RCS|CVS|\.svn)'+sep, is_regex=1)
-
-
-
-
-
-
-
+def write_file (filename, contents):
+ """Create a file with the specified name and write 'contents' (a
+ sequence of strings without line terminators) to it.
+ """
+ f = open(filename, "wb") # always write POSIX-style manifest
+ f.write("\n".join(contents))
+ f.close()
1
0
The Buildbot has detected a new failure of sparc Ubuntu 2.5.
Full details are available at:
http://www.python.org/dev/buildbot/all/sparc%20Ubuntu%202.5/builds/19
Buildbot URL: http://www.python.org/dev/buildbot/all/
Buildslave for this Build: klose-ubuntu-sparc
Build Reason:
Build Source Stamp: [branch branches/release25-maint] HEAD
Blamelist: georg.brandl,sean.reifschneider,thomas.heller
BUILD FAILED: failed test
Excerpt from the test logfile:
4 tests failed:
test_bsddb3 test_fcntl test_ioctl test_resource
======================================================================
FAIL: test_get_key (bsddb.test.test_sequence.DBSequenceTest)
----------------------------------------------------------------------
Traceback (most recent call last):
File "/home/pybot/buildarea/2.5.klose-ubuntu-sparc/build/Lib/bsddb/test/test_sequence.py", line 67, in test_get_key
self.assertEquals(key, self.seq.get_key())
AssertionError: 'foo' != ''
Traceback (most recent call last):
File "./Lib/test/regrtest.py", line 549, in runtest_inner
the_package = __import__(abstest, globals(), locals(), [])
File "/home/pybot/buildarea/2.5.klose-ubuntu-sparc/build/Lib/test/test_fcntl.py", line 53, in <module>
rv = fcntl.fcntl(f.fileno(), fcntl.F_SETLKW, lockdata)
IOError: [Errno 14] Bad address
======================================================================
ERROR: test_ioctl (test.test_ioctl.IoctlTests)
----------------------------------------------------------------------
Traceback (most recent call last):
File "/home/pybot/buildarea/2.5.klose-ubuntu-sparc/build/Lib/test/test_ioctl.py", line 23, in test_ioctl
r = fcntl.ioctl(tty, termios.TIOCGPGRP, " ")
IOError: [Errno 14] Bad address
======================================================================
ERROR: test_ioctl_mutate (test.test_ioctl.IoctlTests)
----------------------------------------------------------------------
Traceback (most recent call last):
File "/home/pybot/buildarea/2.5.klose-ubuntu-sparc/build/Lib/test/test_ioctl.py", line 32, in test_ioctl_mutate
r = fcntl.ioctl(tty, termios.TIOCGPGRP, buf, 1)
IOError: [Errno 14] Bad address
Traceback (most recent call last):
File "./Lib/test/regrtest.py", line 549, in runtest_inner
the_package = __import__(abstest, globals(), locals(), [])
File "/home/pybot/buildarea/2.5.klose-ubuntu-sparc/build/Lib/test/test_resource.py", line 42, in <module>
f.close()
IOError: [Errno 27] File too large
make: *** [buildbottest] Error 1
sincerely,
-The Buildbot
1
0
The Buildbot has detected a new failure of x86 XP-3 trunk.
Full details are available at:
http://www.python.org/dev/buildbot/all/x86%20XP-3%20trunk/builds/270
Buildbot URL: http://www.python.org/dev/buildbot/all/
Buildslave for this Build: heller-windows
Build Reason: The web-page 'force build' button was pressed by 'Thomas Heller': a test
Build Source Stamp: [branch branches/py3k] HEAD
Blamelist:
BUILD FAILED: failed test
Excerpt from the test logfile:
13 tests failed:
test_csv test_dumbdbm test_file test_fileinput test_gettext
test_io test_largefile test_mailbox test_netrc test_pep277
test_subprocess test_tempfile test_urllib2net
======================================================================
FAIL: test_read_escape_fieldsep (test.test_csv.TestEscapedExcel)
----------------------------------------------------------------------
Traceback (most recent call last):
File "C:\buildbot\work\trunk.heller-windows\build\lib\test\test_csv.py", line 500, in test_read_escape_fieldsep
self.readerAssertEqual('abc\\,def\r\n', [['abc,def']])
File "C:\buildbot\work\trunk.heller-windows\build\lib\test\test_csv.py", line 383, in readerAssertEqual
self.assertEqual(fields, expected_result)
AssertionError: [['abc,def'], []] != [['abc,def']]
======================================================================
FAIL: test_read_escape_fieldsep (test.test_csv.TestQuotedEscapedExcel)
----------------------------------------------------------------------
Traceback (most recent call last):
File "C:\buildbot\work\trunk.heller-windows\build\lib\test\test_csv.py", line 513, in test_read_escape_fieldsep
self.readerAssertEqual('"abc\\,def"\r\n', [['abc,def']])
File "C:\buildbot\work\trunk.heller-windows\build\lib\test\test_csv.py", line 383, in readerAssertEqual
self.assertEqual(fields, expected_result)
AssertionError: [['abc,def'], []] != [['abc,def']]
======================================================================
ERROR: test_line_endings (test.test_dumbdbm.DumbDBMTestCase)
----------------------------------------------------------------------
Traceback (most recent call last):
File "C:\buildbot\work\trunk.heller-windows\build\lib\test\test_dumbdbm.py", line 121, in test_line_endings
f = dumbdbm.open(_fname)
File "C:\buildbot\work\trunk.heller-windows\build\lib\dumbdbm.py", line 256, in open
return _Database(file, mode)
File "C:\buildbot\work\trunk.heller-windows\build\lib\dumbdbm.py", line 73, in __init__
self._update()
File "C:\buildbot\work\trunk.heller-windows\build\lib\dumbdbm.py", line 85, in _update
key, pos_and_siz_pair = eval(line)
File "<string>", line 0
^
SyntaxError: unexpected EOF while parsing
======================================================================
ERROR: testTruncateOnWindows (test.test_file.OtherFileTests)
----------------------------------------------------------------------
Traceback (most recent call last):
File "C:\buildbot\work\trunk.heller-windows\build\lib\test\test_file.py", line 212, in testTruncateOnWindows
os.unlink(TESTFN)
WindowsError: [Error 32] The process cannot access the file because it is being used by another process: '@test'
======================================================================
FAIL: test_buffer_sizes (test.test_fileinput.BufferSizesTests)
----------------------------------------------------------------------
Traceback (most recent call last):
File "C:\buildbot\work\trunk.heller-windows\build\lib\test\test_fileinput.py", line 42, in test_buffer_sizes
self.buffer_size_test(t1, t2, t3, t4, bs, round)
File "C:\buildbot\work\trunk.heller-windows\build\lib\test\test_fileinput.py", line 119, in buffer_size_test
self.assertNotEqual(m, None)
AssertionError: None == None
======================================================================
ERROR: test_weird_metadata (test.test_gettext.WeirdMetadataTest)
----------------------------------------------------------------------
Traceback (most recent call last):
File "C:\buildbot\work\trunk.heller-windows\build\lib\test\test_gettext.py", line 335, in test_weird_metadata
self.assertEqual(info['last-translator'],
KeyError: 'last-translator'
======================================================================
FAIL: test_buffered_file_io (test.test_io.IOTest)
----------------------------------------------------------------------
Traceback (most recent call last):
File "C:\buildbot\work\trunk.heller-windows\build\lib\test\test_io.py", line 163, in test_buffered_file_io
self.write_ops(f)
File "C:\buildbot\work\trunk.heller-windows\build\lib\test\test_io.py", line 97, in write_ops
self.assertEqual(f.tell(), 13)
AssertionError: 12 != 13
======================================================================
FAIL: test_large_file_ops (test.test_io.IOTest)
----------------------------------------------------------------------
Traceback (most recent call last):
File "C:\buildbot\work\trunk.heller-windows\build\lib\test\test_io.py", line 206, in test_large_file_ops
self.large_file_ops(f)
File "C:\buildbot\work\trunk.heller-windows\build\lib\test\test_io.py", line 139, in large_file_ops
self.assertEqual(f.tell(), self.LARGE + 2)
AssertionError: 2147483649 != 2147483650
======================================================================
FAIL: test_raw_file_io (test.test_io.IOTest)
----------------------------------------------------------------------
Traceback (most recent call last):
File "C:\buildbot\work\trunk.heller-windows\build\lib\test\test_io.py", line 149, in test_raw_file_io
self.write_ops(f)
File "C:\buildbot\work\trunk.heller-windows\build\lib\test\test_io.py", line 97, in write_ops
self.assertEqual(f.tell(), 13)
AssertionError: 12 != 13
======================================================================
ERROR: test_add (test.test_mailbox.TestMbox)
----------------------------------------------------------------------
Traceback (most recent call last):
File "C:\buildbot\work\trunk.heller-windows\build\lib\test\test_mailbox.py", line 697, in tearDown
self._delete_recursively(self._path)
File "C:\buildbot\work\trunk.heller-windows\build\lib\test\test_mailbox.py", line 47, in _delete_recursively
os.remove(target)
WindowsError: [Error 32] The process cannot access the file because it is being used by another process: '@test'
======================================================================
ERROR: test_add_and_close (test.test_mailbox.TestMbox)
----------------------------------------------------------------------
Traceback (most recent call last):
File "C:\buildbot\work\trunk.heller-windows\build\lib\test\test_mailbox.py", line 57, in setUp
self._delete_recursively(self._path)
File "C:\buildbot\work\trunk.heller-windows\build\lib\test\test_mailbox.py", line 47, in _delete_recursively
os.remove(target)
WindowsError: [Error 32] The process cannot access the file because it is being used by another process: '@test'
======================================================================
ERROR: test_add_from_string (test.test_mailbox.TestMbox)
----------------------------------------------------------------------
Traceback (most recent call last):
File "C:\buildbot\work\trunk.heller-windows\build\lib\test\test_mailbox.py", line 57, in setUp
self._delete_recursively(self._path)
File "C:\buildbot\work\trunk.heller-windows\build\lib\test\test_mailbox.py", line 47, in _delete_recursively
os.remove(target)
WindowsError: [Error 32] The process cannot access the file because it is being used by another process: '@test'
======================================================================
ERROR: test_add_mbox_or_mmdf_message (test.test_mailbox.TestMbox)
----------------------------------------------------------------------
Traceback (most recent call last):
File "C:\buildbot\work\trunk.heller-windows\build\lib\test\test_mailbox.py", line 57, in setUp
self._delete_recursively(self._path)
File "C:\buildbot\work\trunk.heller-windows\build\lib\test\test_mailbox.py", line 47, in _delete_recursively
os.remove(target)
WindowsError: [Error 32] The process cannot access the file because it is being used by another process: '@test'
======================================================================
ERROR: test_clear (test.test_mailbox.TestMbox)
----------------------------------------------------------------------
Traceback (most recent call last):
File "C:\buildbot\work\trunk.heller-windows\build\lib\test\test_mailbox.py", line 57, in setUp
self._delete_recursively(self._path)
File "C:\buildbot\work\trunk.heller-windows\build\lib\test\test_mailbox.py", line 47, in _delete_recursively
os.remove(target)
WindowsError: [Error 32] The process cannot access the file because it is being used by another process: '@test'
======================================================================
ERROR: test_close (test.test_mailbox.TestMbox)
----------------------------------------------------------------------
Traceback (most recent call last):
File "C:\buildbot\work\trunk.heller-windows\build\lib\test\test_mailbox.py", line 57, in setUp
self._delete_recursively(self._path)
File "C:\buildbot\work\trunk.heller-windows\build\lib\test\test_mailbox.py", line 47, in _delete_recursively
os.remove(target)
WindowsError: [Error 32] The process cannot access the file because it is being used by another process: '@test'
======================================================================
ERROR: test_contains (test.test_mailbox.TestMbox)
----------------------------------------------------------------------
Traceback (most recent call last):
File "C:\buildbot\work\trunk.heller-windows\build\lib\test\test_mailbox.py", line 57, in setUp
self._delete_recursively(self._path)
File "C:\buildbot\work\trunk.heller-windows\build\lib\test\test_mailbox.py", line 47, in _delete_recursively
os.remove(target)
WindowsError: [Error 32] The process cannot access the file because it is being used by another process: '@test'
======================================================================
ERROR: test_delitem (test.test_mailbox.TestMbox)
----------------------------------------------------------------------
Traceback (most recent call last):
File "C:\buildbot\work\trunk.heller-windows\build\lib\test\test_mailbox.py", line 57, in setUp
self._delete_recursively(self._path)
File "C:\buildbot\work\trunk.heller-windows\build\lib\test\test_mailbox.py", line 47, in _delete_recursively
os.remove(target)
WindowsError: [Error 32] The process cannot access the file because it is being used by another process: '@test'
======================================================================
ERROR: test_discard (test.test_mailbox.TestMbox)
----------------------------------------------------------------------
Traceback (most recent call last):
File "C:\buildbot\work\trunk.heller-windows\build\lib\test\test_mailbox.py", line 57, in setUp
self._delete_recursively(self._path)
File "C:\buildbot\work\trunk.heller-windows\build\lib\test\test_mailbox.py", line 47, in _delete_recursively
os.remove(target)
WindowsError: [Error 32] The process cannot access the file because it is being used by another process: '@test'
======================================================================
ERROR: test_dump_message (test.test_mailbox.TestMbox)
----------------------------------------------------------------------
Traceback (most recent call last):
File "C:\buildbot\work\trunk.heller-windows\build\lib\test\test_mailbox.py", line 57, in setUp
self._delete_recursively(self._path)
File "C:\buildbot\work\trunk.heller-windows\build\lib\test\test_mailbox.py", line 47, in _delete_recursively
os.remove(target)
WindowsError: [Error 32] The process cannot access the file because it is being used by another process: '@test'
======================================================================
ERROR: test_flush (test.test_mailbox.TestMbox)
----------------------------------------------------------------------
Traceback (most recent call last):
File "C:\buildbot\work\trunk.heller-windows\build\lib\test\test_mailbox.py", line 57, in setUp
self._delete_recursively(self._path)
File "C:\buildbot\work\trunk.heller-windows\build\lib\test\test_mailbox.py", line 47, in _delete_recursively
os.remove(target)
WindowsError: [Error 32] The process cannot access the file because it is being used by another process: '@test'
======================================================================
ERROR: test_get (test.test_mailbox.TestMbox)
----------------------------------------------------------------------
Traceback (most recent call last):
File "C:\buildbot\work\trunk.heller-windows\build\lib\test\test_mailbox.py", line 57, in setUp
self._delete_recursively(self._path)
File "C:\buildbot\work\trunk.heller-windows\build\lib\test\test_mailbox.py", line 47, in _delete_recursively
os.remove(target)
WindowsError: [Error 32] The process cannot access the file because it is being used by another process: '@test'
======================================================================
ERROR: test_get_file (test.test_mailbox.TestMbox)
----------------------------------------------------------------------
Traceback (most recent call last):
File "C:\buildbot\work\trunk.heller-windows\build\lib\test\test_mailbox.py", line 57, in setUp
self._delete_recursively(self._path)
File "C:\buildbot\work\trunk.heller-windows\build\lib\test\test_mailbox.py", line 47, in _delete_recursively
os.remove(target)
WindowsError: [Error 32] The process cannot access the file because it is being used by another process: '@test'
======================================================================
ERROR: test_get_message (test.test_mailbox.TestMbox)
----------------------------------------------------------------------
Traceback (most recent call last):
File "C:\buildbot\work\trunk.heller-windows\build\lib\test\test_mailbox.py", line 57, in setUp
self._delete_recursively(self._path)
File "C:\buildbot\work\trunk.heller-windows\build\lib\test\test_mailbox.py", line 47, in _delete_recursively
os.remove(target)
WindowsError: [Error 32] The process cannot access the file because it is being used by another process: '@test'
======================================================================
ERROR: test_get_string (test.test_mailbox.TestMbox)
----------------------------------------------------------------------
Traceback (most recent call last):
File "C:\buildbot\work\trunk.heller-windows\build\lib\test\test_mailbox.py", line 57, in setUp
self._delete_recursively(self._path)
File "C:\buildbot\work\trunk.heller-windows\build\lib\test\test_mailbox.py", line 47, in _delete_recursively
os.remove(target)
WindowsError: [Error 32] The process cannot access the file because it is being used by another process: '@test'
======================================================================
ERROR: test_getitem (test.test_mailbox.TestMbox)
----------------------------------------------------------------------
Traceback (most recent call last):
File "C:\buildbot\work\trunk.heller-windows\build\lib\test\test_mailbox.py", line 57, in setUp
self._delete_recursively(self._path)
File "C:\buildbot\work\trunk.heller-windows\build\lib\test\test_mailbox.py", line 47, in _delete_recursively
os.remove(target)
WindowsError: [Error 32] The process cannot access the file because it is being used by another process: '@test'
======================================================================
ERROR: test_items (test.test_mailbox.TestMbox)
----------------------------------------------------------------------
Traceback (most recent call last):
File "C:\buildbot\work\trunk.heller-windows\build\lib\test\test_mailbox.py", line 57, in setUp
self._delete_recursively(self._path)
File "C:\buildbot\work\trunk.heller-windows\build\lib\test\test_mailbox.py", line 47, in _delete_recursively
os.remove(target)
WindowsError: [Error 32] The process cannot access the file because it is being used by another process: '@test'
======================================================================
ERROR: test_iter (test.test_mailbox.TestMbox)
----------------------------------------------------------------------
Traceback (most recent call last):
File "C:\buildbot\work\trunk.heller-windows\build\lib\test\test_mailbox.py", line 57, in setUp
self._delete_recursively(self._path)
File "C:\buildbot\work\trunk.heller-windows\build\lib\test\test_mailbox.py", line 47, in _delete_recursively
os.remove(target)
WindowsError: [Error 32] The process cannot access the file because it is being used by another process: '@test'
======================================================================
ERROR: test_iteritems (test.test_mailbox.TestMbox)
----------------------------------------------------------------------
Traceback (most recent call last):
File "C:\buildbot\work\trunk.heller-windows\build\lib\test\test_mailbox.py", line 57, in setUp
self._delete_recursively(self._path)
File "C:\buildbot\work\trunk.heller-windows\build\lib\test\test_mailbox.py", line 47, in _delete_recursively
os.remove(target)
WindowsError: [Error 32] The process cannot access the file because it is being used by another process: '@test'
======================================================================
ERROR: test_iterkeys (test.test_mailbox.TestMbox)
----------------------------------------------------------------------
Traceback (most recent call last):
File "C:\buildbot\work\trunk.heller-windows\build\lib\test\test_mailbox.py", line 57, in setUp
self._delete_recursively(self._path)
File "C:\buildbot\work\trunk.heller-windows\build\lib\test\test_mailbox.py", line 47, in _delete_recursively
os.remove(target)
WindowsError: [Error 32] The process cannot access the file because it is being used by another process: '@test'
======================================================================
ERROR: test_itervalues (test.test_mailbox.TestMbox)
----------------------------------------------------------------------
Traceback (most recent call last):
File "C:\buildbot\work\trunk.heller-windows\build\lib\test\test_mailbox.py", line 57, in setUp
self._delete_recursively(self._path)
File "C:\buildbot\work\trunk.heller-windows\build\lib\test\test_mailbox.py", line 47, in _delete_recursively
os.remove(target)
WindowsError: [Error 32] The process cannot access the file because it is being used by another process: '@test'
======================================================================
ERROR: test_keys (test.test_mailbox.TestMbox)
----------------------------------------------------------------------
Traceback (most recent call last):
File "C:\buildbot\work\trunk.heller-windows\build\lib\test\test_mailbox.py", line 57, in setUp
self._delete_recursively(self._path)
File "C:\buildbot\work\trunk.heller-windows\build\lib\test\test_mailbox.py", line 47, in _delete_recursively
os.remove(target)
WindowsError: [Error 32] The process cannot access the file because it is being used by another process: '@test'
======================================================================
ERROR: test_len (test.test_mailbox.TestMbox)
----------------------------------------------------------------------
Traceback (most recent call last):
File "C:\buildbot\work\trunk.heller-windows\build\lib\test\test_mailbox.py", line 57, in setUp
self._delete_recursively(self._path)
File "C:\buildbot\work\trunk.heller-windows\build\lib\test\test_mailbox.py", line 47, in _delete_recursively
os.remove(target)
WindowsError: [Error 32] The process cannot access the file because it is being used by another process: '@test'
======================================================================
ERROR: test_lock_conflict (test.test_mailbox.TestMbox)
----------------------------------------------------------------------
Traceback (most recent call last):
File "C:\buildbot\work\trunk.heller-windows\build\lib\test\test_mailbox.py", line 57, in setUp
self._delete_recursively(self._path)
File "C:\buildbot\work\trunk.heller-windows\build\lib\test\test_mailbox.py", line 47, in _delete_recursively
os.remove(target)
WindowsError: [Error 32] The process cannot access the file because it is being used by another process: '@test'
======================================================================
ERROR: test_lock_unlock (test.test_mailbox.TestMbox)
----------------------------------------------------------------------
Traceback (most recent call last):
File "C:\buildbot\work\trunk.heller-windows\build\lib\test\test_mailbox.py", line 57, in setUp
self._delete_recursively(self._path)
File "C:\buildbot\work\trunk.heller-windows\build\lib\test\test_mailbox.py", line 47, in _delete_recursively
os.remove(target)
WindowsError: [Error 32] The process cannot access the file because it is being used by another process: '@test'
======================================================================
ERROR: test_open_close_open (test.test_mailbox.TestMbox)
----------------------------------------------------------------------
Traceback (most recent call last):
File "C:\buildbot\work\trunk.heller-windows\build\lib\test\test_mailbox.py", line 57, in setUp
self._delete_recursively(self._path)
File "C:\buildbot\work\trunk.heller-windows\build\lib\test\test_mailbox.py", line 47, in _delete_recursively
os.remove(target)
WindowsError: [Error 32] The process cannot access the file because it is being used by another process: '@test'
======================================================================
ERROR: test_pop (test.test_mailbox.TestMbox)
----------------------------------------------------------------------
Traceback (most recent call last):
File "C:\buildbot\work\trunk.heller-windows\build\lib\test\test_mailbox.py", line 57, in setUp
self._delete_recursively(self._path)
File "C:\buildbot\work\trunk.heller-windows\build\lib\test\test_mailbox.py", line 47, in _delete_recursively
os.remove(target)
WindowsError: [Error 32] The process cannot access the file because it is being used by another process: '@test'
======================================================================
ERROR: test_popitem (test.test_mailbox.TestMbox)
----------------------------------------------------------------------
Traceback (most recent call last):
File "C:\buildbot\work\trunk.heller-windows\build\lib\test\test_mailbox.py", line 57, in setUp
self._delete_recursively(self._path)
File "C:\buildbot\work\trunk.heller-windows\build\lib\test\test_mailbox.py", line 47, in _delete_recursively
os.remove(target)
WindowsError: [Error 32] The process cannot access the file because it is being used by another process: '@test'
======================================================================
ERROR: test_relock (test.test_mailbox.TestMbox)
----------------------------------------------------------------------
Traceback (most recent call last):
File "C:\buildbot\work\trunk.heller-windows\build\lib\test\test_mailbox.py", line 57, in setUp
self._delete_recursively(self._path)
File "C:\buildbot\work\trunk.heller-windows\build\lib\test\test_mailbox.py", line 47, in _delete_recursively
os.remove(target)
WindowsError: [Error 32] The process cannot access the file because it is being used by another process: '@test'
======================================================================
ERROR: test_remove (test.test_mailbox.TestMbox)
----------------------------------------------------------------------
Traceback (most recent call last):
File "C:\buildbot\work\trunk.heller-windows\build\lib\test\test_mailbox.py", line 57, in setUp
self._delete_recursively(self._path)
File "C:\buildbot\work\trunk.heller-windows\build\lib\test\test_mailbox.py", line 47, in _delete_recursively
os.remove(target)
WindowsError: [Error 32] The process cannot access the file because it is being used by another process: '@test'
======================================================================
ERROR: test_set_item (test.test_mailbox.TestMbox)
----------------------------------------------------------------------
Traceback (most recent call last):
File "C:\buildbot\work\trunk.heller-windows\build\lib\test\test_mailbox.py", line 57, in setUp
self._delete_recursively(self._path)
File "C:\buildbot\work\trunk.heller-windows\build\lib\test\test_mailbox.py", line 47, in _delete_recursively
os.remove(target)
WindowsError: [Error 32] The process cannot access the file because it is being used by another process: '@test'
======================================================================
ERROR: test_update (test.test_mailbox.TestMbox)
----------------------------------------------------------------------
Traceback (most recent call last):
File "C:\buildbot\work\trunk.heller-windows\build\lib\test\test_mailbox.py", line 57, in setUp
self._delete_recursively(self._path)
File "C:\buildbot\work\trunk.heller-windows\build\lib\test\test_mailbox.py", line 47, in _delete_recursively
os.remove(target)
WindowsError: [Error 32] The process cannot access the file because it is being used by another process: '@test'
======================================================================
ERROR: test_values (test.test_mailbox.TestMbox)
----------------------------------------------------------------------
Traceback (most recent call last):
File "C:\buildbot\work\trunk.heller-windows\build\lib\test\test_mailbox.py", line 57, in setUp
self._delete_recursively(self._path)
File "C:\buildbot\work\trunk.heller-windows\build\lib\test\test_mailbox.py", line 47, in _delete_recursively
os.remove(target)
WindowsError: [Error 32] The process cannot access the file because it is being used by another process: '@test'
======================================================================
ERROR: test_add (test.test_mailbox.TestMMDF)
----------------------------------------------------------------------
Traceback (most recent call last):
File "C:\buildbot\work\trunk.heller-windows\build\lib\test\test_mailbox.py", line 57, in setUp
self._delete_recursively(self._path)
File "C:\buildbot\work\trunk.heller-windows\build\lib\test\test_mailbox.py", line 47, in _delete_recursively
os.remove(target)
WindowsError: [Error 32] The process cannot access the file because it is being used by another process: '@test'
======================================================================
ERROR: test_add_and_close (test.test_mailbox.TestMMDF)
----------------------------------------------------------------------
Traceback (most recent call last):
File "C:\buildbot\work\trunk.heller-windows\build\lib\test\test_mailbox.py", line 57, in setUp
self._delete_recursively(self._path)
File "C:\buildbot\work\trunk.heller-windows\build\lib\test\test_mailbox.py", line 47, in _delete_recursively
os.remove(target)
WindowsError: [Error 32] The process cannot access the file because it is being used by another process: '@test'
======================================================================
ERROR: test_add_from_string (test.test_mailbox.TestMMDF)
----------------------------------------------------------------------
Traceback (most recent call last):
File "C:\buildbot\work\trunk.heller-windows\build\lib\test\test_mailbox.py", line 57, in setUp
self._delete_recursively(self._path)
File "C:\buildbot\work\trunk.heller-windows\build\lib\test\test_mailbox.py", line 47, in _delete_recursively
os.remove(target)
WindowsError: [Error 32] The process cannot access the file because it is being used by another process: '@test'
======================================================================
ERROR: test_add_mbox_or_mmdf_message (test.test_mailbox.TestMMDF)
----------------------------------------------------------------------
Traceback (most recent call last):
File "C:\buildbot\work\trunk.heller-windows\build\lib\test\test_mailbox.py", line 57, in setUp
self._delete_recursively(self._path)
File "C:\buildbot\work\trunk.heller-windows\build\lib\test\test_mailbox.py", line 47, in _delete_recursively
os.remove(target)
WindowsError: [Error 32] The process cannot access the file because it is being used by another process: '@test'
======================================================================
ERROR: test_clear (test.test_mailbox.TestMMDF)
----------------------------------------------------------------------
Traceback (most recent call last):
File "C:\buildbot\work\trunk.heller-windows\build\lib\test\test_mailbox.py", line 57, in setUp
self._delete_recursively(self._path)
File "C:\buildbot\work\trunk.heller-windows\build\lib\test\test_mailbox.py", line 47, in _delete_recursively
os.remove(target)
WindowsError: [Error 32] The process cannot access the file because it is being used by another process: '@test'
======================================================================
ERROR: test_close (test.test_mailbox.TestMMDF)
----------------------------------------------------------------------
Traceback (most recent call last):
File "C:\buildbot\work\trunk.heller-windows\build\lib\test\test_mailbox.py", line 57, in setUp
self._delete_recursively(self._path)
File "C:\buildbot\work\trunk.heller-windows\build\lib\test\test_mailbox.py", line 47, in _delete_recursively
os.remove(target)
WindowsError: [Error 32] The process cannot access the file because it is being used by another process: '@test'
======================================================================
ERROR: test_contains (test.test_mailbox.TestMMDF)
----------------------------------------------------------------------
Traceback (most recent call last):
File "C:\buildbot\work\trunk.heller-windows\build\lib\test\test_mailbox.py", line 57, in setUp
self._delete_recursively(self._path)
File "C:\buildbot\work\trunk.heller-windows\build\lib\test\test_mailbox.py", line 47, in _delete_recursively
os.remove(target)
WindowsError: [Error 32] The process cannot access the file because it is being used by another process: '@test'
======================================================================
ERROR: test_delitem (test.test_mailbox.TestMMDF)
----------------------------------------------------------------------
Traceback (most recent call last):
File "C:\buildbot\work\trunk.heller-windows\build\lib\test\test_mailbox.py", line 57, in setUp
self._delete_recursively(self._path)
File "C:\buildbot\work\trunk.heller-windows\build\lib\test\test_mailbox.py", line 47, in _delete_recursively
os.remove(target)
WindowsError: [Error 32] The process cannot access the file because it is being used by another process: '@test'
======================================================================
ERROR: test_discard (test.test_mailbox.TestMMDF)
----------------------------------------------------------------------
Traceback (most recent call last):
File "C:\buildbot\work\trunk.heller-windows\build\lib\test\test_mailbox.py", line 57, in setUp
self._delete_recursively(self._path)
File "C:\buildbot\work\trunk.heller-windows\build\lib\test\test_mailbox.py", line 47, in _delete_recursively
os.remove(target)
WindowsError: [Error 32] The process cannot access the file because it is being used by another process: '@test'
======================================================================
ERROR: test_dump_message (test.test_mailbox.TestMMDF)
----------------------------------------------------------------------
Traceback (most recent call last):
File "C:\buildbot\work\trunk.heller-windows\build\lib\test\test_mailbox.py", line 57, in setUp
self._delete_recursively(self._path)
File "C:\buildbot\work\trunk.heller-windows\build\lib\test\test_mailbox.py", line 47, in _delete_recursively
os.remove(target)
WindowsError: [Error 32] The process cannot access the file because it is being used by another process: '@test'
======================================================================
ERROR: test_flush (test.test_mailbox.TestMMDF)
----------------------------------------------------------------------
Traceback (most recent call last):
File "C:\buildbot\work\trunk.heller-windows\build\lib\test\test_mailbox.py", line 57, in setUp
self._delete_recursively(self._path)
File "C:\buildbot\work\trunk.heller-windows\build\lib\test\test_mailbox.py", line 47, in _delete_recursively
os.remove(target)
WindowsError: [Error 32] The process cannot access the file because it is being used by another process: '@test'
======================================================================
ERROR: test_get (test.test_mailbox.TestMMDF)
----------------------------------------------------------------------
Traceback (most recent call last):
File "C:\buildbot\work\trunk.heller-windows\build\lib\test\test_mailbox.py", line 57, in setUp
self._delete_recursively(self._path)
File "C:\buildbot\work\trunk.heller-windows\build\lib\test\test_mailbox.py", line 47, in _delete_recursively
os.remove(target)
WindowsError: [Error 32] The process cannot access the file because it is being used by another process: '@test'
======================================================================
ERROR: test_get_file (test.test_mailbox.TestMMDF)
----------------------------------------------------------------------
Traceback (most recent call last):
File "C:\buildbot\work\trunk.heller-windows\build\lib\test\test_mailbox.py", line 57, in setUp
self._delete_recursively(self._path)
File "C:\buildbot\work\trunk.heller-windows\build\lib\test\test_mailbox.py", line 47, in _delete_recursively
os.remove(target)
WindowsError: [Error 32] The process cannot access the file because it is being used by another process: '@test'
======================================================================
ERROR: test_get_message (test.test_mailbox.TestMMDF)
----------------------------------------------------------------------
Traceback (most recent call last):
File "C:\buildbot\work\trunk.heller-windows\build\lib\test\test_mailbox.py", line 57, in setUp
self._delete_recursively(self._path)
File "C:\buildbot\work\trunk.heller-windows\build\lib\test\test_mailbox.py", line 47, in _delete_recursively
os.remove(target)
WindowsError: [Error 32] The process cannot access the file because it is being used by another process: '@test'
======================================================================
ERROR: test_get_string (test.test_mailbox.TestMMDF)
----------------------------------------------------------------------
Traceback (most recent call last):
File "C:\buildbot\work\trunk.heller-windows\build\lib\test\test_mailbox.py", line 57, in setUp
self._delete_recursively(self._path)
File "C:\buildbot\work\trunk.heller-windows\build\lib\test\test_mailbox.py", line 47, in _delete_recursively
os.remove(target)
WindowsError: [Error 32] The process cannot access the file because it is being used by another process: '@test'
======================================================================
ERROR: test_getitem (test.test_mailbox.TestMMDF)
----------------------------------------------------------------------
Traceback (most recent call last):
File "C:\buildbot\work\trunk.heller-windows\build\lib\test\test_mailbox.py", line 57, in setUp
self._delete_recursively(self._path)
File "C:\buildbot\work\trunk.heller-windows\build\lib\test\test_mailbox.py", line 47, in _delete_recursively
os.remove(target)
WindowsError: [Error 32] The process cannot access the file because it is being used by another process: '@test'
======================================================================
ERROR: test_items (test.test_mailbox.TestMMDF)
----------------------------------------------------------------------
Traceback (most recent call last):
File "C:\buildbot\work\trunk.heller-windows\build\lib\test\test_mailbox.py", line 57, in setUp
self._delete_recursively(self._path)
File "C:\buildbot\work\trunk.heller-windows\build\lib\test\test_mailbox.py", line 47, in _delete_recursively
os.remove(target)
WindowsError: [Error 32] The process cannot access the file because it is being used by another process: '@test'
======================================================================
ERROR: test_iter (test.test_mailbox.TestMMDF)
----------------------------------------------------------------------
Traceback (most recent call last):
File "C:\buildbot\work\trunk.heller-windows\build\lib\test\test_mailbox.py", line 57, in setUp
self._delete_recursively(self._path)
File "C:\buildbot\work\trunk.heller-windows\build\lib\test\test_mailbox.py", line 47, in _delete_recursively
os.remove(target)
WindowsError: [Error 32] The process cannot access the file because it is being used by another process: '@test'
======================================================================
ERROR: test_iteritems (test.test_mailbox.TestMMDF)
----------------------------------------------------------------------
Traceback (most recent call last):
File "C:\buildbot\work\trunk.heller-windows\build\lib\test\test_mailbox.py", line 57, in setUp
self._delete_recursively(self._path)
File "C:\buildbot\work\trunk.heller-windows\build\lib\test\test_mailbox.py", line 47, in _delete_recursively
os.remove(target)
WindowsError: [Error 32] The process cannot access the file because it is being used by another process: '@test'
======================================================================
ERROR: test_iterkeys (test.test_mailbox.TestMMDF)
----------------------------------------------------------------------
Traceback (most recent call last):
File "C:\buildbot\work\trunk.heller-windows\build\lib\test\test_mailbox.py", line 57, in setUp
self._delete_recursively(self._path)
File "C:\buildbot\work\trunk.heller-windows\build\lib\test\test_mailbox.py", line 47, in _delete_recursively
os.remove(target)
WindowsError: [Error 32] The process cannot access the file because it is being used by another process: '@test'
======================================================================
ERROR: test_itervalues (test.test_mailbox.TestMMDF)
----------------------------------------------------------------------
Traceback (most recent call last):
File "C:\buildbot\work\trunk.heller-windows\build\lib\test\test_mailbox.py", line 57, in setUp
self._delete_recursively(self._path)
File "C:\buildbot\work\trunk.heller-windows\build\lib\test\test_mailbox.py", line 47, in _delete_recursively
os.remove(target)
WindowsError: [Error 32] The process cannot access the file because it is being used by another process: '@test'
======================================================================
ERROR: test_keys (test.test_mailbox.TestMMDF)
----------------------------------------------------------------------
Traceback (most recent call last):
File "C:\buildbot\work\trunk.heller-windows\build\lib\test\test_mailbox.py", line 57, in setUp
self._delete_recursively(self._path)
File "C:\buildbot\work\trunk.heller-windows\build\lib\test\test_mailbox.py", line 47, in _delete_recursively
os.remove(target)
WindowsError: [Error 32] The process cannot access the file because it is being used by another process: '@test'
======================================================================
ERROR: test_len (test.test_mailbox.TestMMDF)
----------------------------------------------------------------------
Traceback (most recent call last):
File "C:\buildbot\work\trunk.heller-windows\build\lib\test\test_mailbox.py", line 57, in setUp
self._delete_recursively(self._path)
File "C:\buildbot\work\trunk.heller-windows\build\lib\test\test_mailbox.py", line 47, in _delete_recursively
os.remove(target)
WindowsError: [Error 32] The process cannot access the file because it is being used by another process: '@test'
======================================================================
ERROR: test_lock_conflict (test.test_mailbox.TestMMDF)
----------------------------------------------------------------------
Traceback (most recent call last):
File "C:\buildbot\work\trunk.heller-windows\build\lib\test\test_mailbox.py", line 57, in setUp
self._delete_recursively(self._path)
File "C:\buildbot\work\trunk.heller-windows\build\lib\test\test_mailbox.py", line 47, in _delete_recursively
os.remove(target)
WindowsError: [Error 32] The process cannot access the file because it is being used by another process: '@test'
======================================================================
ERROR: test_lock_unlock (test.test_mailbox.TestMMDF)
----------------------------------------------------------------------
Traceback (most recent call last):
File "C:\buildbot\work\trunk.heller-windows\build\lib\test\test_mailbox.py", line 57, in setUp
self._delete_recursively(self._path)
File "C:\buildbot\work\trunk.heller-windows\build\lib\test\test_mailbox.py", line 47, in _delete_recursively
os.remove(target)
WindowsError: [Error 32] The process cannot access the file because it is being used by another process: '@test'
======================================================================
ERROR: test_open_close_open (test.test_mailbox.TestMMDF)
----------------------------------------------------------------------
Traceback (most recent call last):
File "C:\buildbot\work\trunk.heller-windows\build\lib\test\test_mailbox.py", line 57, in setUp
self._delete_recursively(self._path)
File "C:\buildbot\work\trunk.heller-windows\build\lib\test\test_mailbox.py", line 47, in _delete_recursively
os.remove(target)
WindowsError: [Error 32] The process cannot access the file because it is being used by another process: '@test'
======================================================================
ERROR: test_pop (test.test_mailbox.TestMMDF)
----------------------------------------------------------------------
Traceback (most recent call last):
File "C:\buildbot\work\trunk.heller-windows\build\lib\test\test_mailbox.py", line 57, in setUp
self._delete_recursively(self._path)
File "C:\buildbot\work\trunk.heller-windows\build\lib\test\test_mailbox.py", line 47, in _delete_recursively
os.remove(target)
WindowsError: [Error 32] The process cannot access the file because it is being used by another process: '@test'
======================================================================
ERROR: test_popitem (test.test_mailbox.TestMMDF)
----------------------------------------------------------------------
Traceback (most recent call last):
File "C:\buildbot\work\trunk.heller-windows\build\lib\test\test_mailbox.py", line 57, in setUp
self._delete_recursively(self._path)
File "C:\buildbot\work\trunk.heller-windows\build\lib\test\test_mailbox.py", line 47, in _delete_recursively
os.remove(target)
WindowsError: [Error 32] The process cannot access the file because it is being used by another process: '@test'
======================================================================
ERROR: test_relock (test.test_mailbox.TestMMDF)
----------------------------------------------------------------------
Traceback (most recent call last):
File "C:\buildbot\work\trunk.heller-windows\build\lib\test\test_mailbox.py", line 57, in setUp
self._delete_recursively(self._path)
File "C:\buildbot\work\trunk.heller-windows\build\lib\test\test_mailbox.py", line 47, in _delete_recursively
os.remove(target)
WindowsError: [Error 32] The process cannot access the file because it is being used by another process: '@test'
======================================================================
ERROR: test_remove (test.test_mailbox.TestMMDF)
----------------------------------------------------------------------
Traceback (most recent call last):
File "C:\buildbot\work\trunk.heller-windows\build\lib\test\test_mailbox.py", line 57, in setUp
self._delete_recursively(self._path)
File "C:\buildbot\work\trunk.heller-windows\build\lib\test\test_mailbox.py", line 47, in _delete_recursively
os.remove(target)
WindowsError: [Error 32] The process cannot access the file because it is being used by another process: '@test'
======================================================================
ERROR: test_set_item (test.test_mailbox.TestMMDF)
----------------------------------------------------------------------
Traceback (most recent call last):
File "C:\buildbot\work\trunk.heller-windows\build\lib\test\test_mailbox.py", line 57, in setUp
self._delete_recursively(self._path)
File "C:\buildbot\work\trunk.heller-windows\build\lib\test\test_mailbox.py", line 47, in _delete_recursively
os.remove(target)
WindowsError: [Error 32] The process cannot access the file because it is being used by another process: '@test'
======================================================================
ERROR: test_update (test.test_mailbox.TestMMDF)
----------------------------------------------------------------------
Traceback (most recent call last):
File "C:\buildbot\work\trunk.heller-windows\build\lib\test\test_mailbox.py", line 57, in setUp
self._delete_recursively(self._path)
File "C:\buildbot\work\trunk.heller-windows\build\lib\test\test_mailbox.py", line 47, in _delete_recursively
os.remove(target)
WindowsError: [Error 32] The process cannot access the file because it is being used by another process: '@test'
======================================================================
ERROR: test_values (test.test_mailbox.TestMMDF)
----------------------------------------------------------------------
Traceback (most recent call last):
File "C:\buildbot\work\trunk.heller-windows\build\lib\test\test_mailbox.py", line 57, in setUp
self._delete_recursively(self._path)
File "C:\buildbot\work\trunk.heller-windows\build\lib\test\test_mailbox.py", line 47, in _delete_recursively
os.remove(target)
WindowsError: [Error 32] The process cannot access the file because it is being used by another process: '@test'
======================================================================
ERROR: test_add (test.test_mailbox.TestMH)
----------------------------------------------------------------------
Traceback (most recent call last):
File "C:\buildbot\work\trunk.heller-windows\build\lib\test\test_mailbox.py", line 57, in setUp
self._delete_recursively(self._path)
File "C:\buildbot\work\trunk.heller-windows\build\lib\test\test_mailbox.py", line 47, in _delete_recursively
os.remove(target)
WindowsError: [Error 32] The process cannot access the file because it is being used by another process: '@test'
======================================================================
ERROR: test_add_and_remove_folders (test.test_mailbox.TestMH)
----------------------------------------------------------------------
Traceback (most recent call last):
File "C:\buildbot\work\trunk.heller-windows\build\lib\test\test_mailbox.py", line 57, in setUp
self._delete_recursively(self._path)
File "C:\buildbot\work\trunk.heller-windows\build\lib\test\test_mailbox.py", line 47, in _delete_recursively
os.remove(target)
WindowsError: [Error 32] The process cannot access the file because it is being used by another process: '@test'
======================================================================
ERROR: test_clear (test.test_mailbox.TestMH)
----------------------------------------------------------------------
Traceback (most recent call last):
File "C:\buildbot\work\trunk.heller-windows\build\lib\test\test_mailbox.py", line 57, in setUp
self._delete_recursively(self._path)
File "C:\buildbot\work\trunk.heller-windows\build\lib\test\test_mailbox.py", line 47, in _delete_recursively
os.remove(target)
WindowsError: [Error 32] The process cannot access the file because it is being used by another process: '@test'
======================================================================
ERROR: test_close (test.test_mailbox.TestMH)
----------------------------------------------------------------------
Traceback (most recent call last):
File "C:\buildbot\work\trunk.heller-windows\build\lib\test\test_mailbox.py", line 57, in setUp
self._delete_recursively(self._path)
File "C:\buildbot\work\trunk.heller-windows\build\lib\test\test_mailbox.py", line 47, in _delete_recursively
os.remove(target)
WindowsError: [Error 32] The process cannot access the file because it is being used by another process: '@test'
======================================================================
ERROR: test_contains (test.test_mailbox.TestMH)
----------------------------------------------------------------------
Traceback (most recent call last):
File "C:\buildbot\work\trunk.heller-windows\build\lib\test\test_mailbox.py", line 57, in setUp
self._delete_recursively(self._path)
File "C:\buildbot\work\trunk.heller-windows\build\lib\test\test_mailbox.py", line 47, in _delete_recursively
os.remove(target)
WindowsError: [Error 32] The process cannot access the file because it is being used by another process: '@test'
======================================================================
ERROR: test_delitem (test.test_mailbox.TestMH)
----------------------------------------------------------------------
Traceback (most recent call last):
File "C:\buildbot\work\trunk.heller-windows\build\lib\test\test_mailbox.py", line 57, in setUp
self._delete_recursively(self._path)
File "C:\buildbot\work\trunk.heller-windows\build\lib\test\test_mailbox.py", line 47, in _delete_recursively
os.remove(target)
WindowsError: [Error 32] The process cannot access the file because it is being used by another process: '@test'
======================================================================
ERROR: test_discard (test.test_mailbox.TestMH)
----------------------------------------------------------------------
Traceback (most recent call last):
File "C:\buildbot\work\trunk.heller-windows\build\lib\test\test_mailbox.py", line 57, in setUp
self._delete_recursively(self._path)
File "C:\buildbot\work\trunk.heller-windows\build\lib\test\test_mailbox.py", line 47, in _delete_recursively
os.remove(target)
WindowsError: [Error 32] The process cannot access the file because it is being used by another process: '@test'
======================================================================
ERROR: test_dump_message (test.test_mailbox.TestMH)
----------------------------------------------------------------------
Traceback (most recent call last):
File "C:\buildbot\work\trunk.heller-windows\build\lib\test\test_mailbox.py", line 57, in setUp
self._delete_recursively(self._path)
File "C:\buildbot\work\trunk.heller-windows\build\lib\test\test_mailbox.py", line 47, in _delete_recursively
os.remove(target)
WindowsError: [Error 32] The process cannot access the file because it is being used by another process: '@test'
======================================================================
ERROR: test_flush (test.test_mailbox.TestMH)
----------------------------------------------------------------------
Traceback (most recent call last):
File "C:\buildbot\work\trunk.heller-windows\build\lib\test\test_mailbox.py", line 57, in setUp
self._delete_recursively(self._path)
File "C:\buildbot\work\trunk.heller-windows\build\lib\test\test_mailbox.py", line 47, in _delete_recursively
os.remove(target)
WindowsError: [Error 32] The process cannot access the file because it is being used by another process: '@test'
======================================================================
ERROR: test_get (test.test_mailbox.TestMH)
----------------------------------------------------------------------
Traceback (most recent call last):
File "C:\buildbot\work\trunk.heller-windows\build\lib\test\test_mailbox.py", line 57, in setUp
self._delete_recursively(self._path)
File "C:\buildbot\work\trunk.heller-windows\build\lib\test\test_mailbox.py", line 47, in _delete_recursively
os.remove(target)
WindowsError: [Error 32] The process cannot access the file because it is being used by another process: '@test'
======================================================================
ERROR: test_get_file (test.test_mailbox.TestMH)
----------------------------------------------------------------------
Traceback (most recent call last):
File "C:\buildbot\work\trunk.heller-windows\build\lib\test\test_mailbox.py", line 57, in setUp
self._delete_recursively(self._path)
File "C:\buildbot\work\trunk.heller-windows\build\lib\test\test_mailbox.py", line 47, in _delete_recursively
os.remove(target)
WindowsError: [Error 32] The process cannot access the file because it is being used by another process: '@test'
======================================================================
ERROR: test_get_folder (test.test_mailbox.TestMH)
----------------------------------------------------------------------
Traceback (most recent call last):
File "C:\buildbot\work\trunk.heller-windows\build\lib\test\test_mailbox.py", line 57, in setUp
self._delete_recursively(self._path)
File "C:\buildbot\work\trunk.heller-windows\build\lib\test\test_mailbox.py", line 47, in _delete_recursively
os.remove(target)
WindowsError: [Error 32] The process cannot access the file because it is being used by another process: '@test'
======================================================================
ERROR: test_get_message (test.test_mailbox.TestMH)
----------------------------------------------------------------------
Traceback (most recent call last):
File "C:\buildbot\work\trunk.heller-windows\build\lib\test\test_mailbox.py", line 57, in setUp
self._delete_recursively(self._path)
File "C:\buildbot\work\trunk.heller-windows\build\lib\test\test_mailbox.py", line 47, in _delete_recursively
os.remove(target)
WindowsError: [Error 32] The process cannot access the file because it is being used by another process: '@test'
======================================================================
ERROR: test_get_string (test.test_mailbox.TestMH)
----------------------------------------------------------------------
Traceback (most recent call last):
File "C:\buildbot\work\trunk.heller-windows\build\lib\test\test_mailbox.py", line 57, in setUp
self._delete_recursively(self._path)
File "C:\buildbot\work\trunk.heller-windows\build\lib\test\test_mailbox.py", line 47, in _delete_recursively
os.remove(target)
WindowsError: [Error 32] The process cannot access the file because it is being used by another process: '@test'
======================================================================
ERROR: test_getitem (test.test_mailbox.TestMH)
----------------------------------------------------------------------
Traceback (most recent call last):
File "C:\buildbot\work\trunk.heller-windows\build\lib\test\test_mailbox.py", line 57, in setUp
self._delete_recursively(self._path)
File "C:\buildbot\work\trunk.heller-windows\build\lib\test\test_mailbox.py", line 47, in _delete_recursively
os.remove(target)
WindowsError: [Error 32] The process cannot access the file because it is being used by another process: '@test'
======================================================================
ERROR: test_items (test.test_mailbox.TestMH)
----------------------------------------------------------------------
Traceback (most recent call last):
File "C:\buildbot\work\trunk.heller-windows\build\lib\test\test_mailbox.py", line 57, in setUp
self._delete_recursively(self._path)
File "C:\buildbot\work\trunk.heller-windows\build\lib\test\test_mailbox.py", line 47, in _delete_recursively
os.remove(target)
WindowsError: [Error 32] The process cannot access the file because it is being used by another process: '@test'
======================================================================
ERROR: test_iter (test.test_mailbox.TestMH)
----------------------------------------------------------------------
Traceback (most recent call last):
File "C:\buildbot\work\trunk.heller-windows\build\lib\test\test_mailbox.py", line 57, in setUp
self._delete_recursively(self._path)
File "C:\buildbot\work\trunk.heller-windows\build\lib\test\test_mailbox.py", line 47, in _delete_recursively
os.remove(target)
WindowsError: [Error 32] The process cannot access the file because it is being used by another process: '@test'
======================================================================
ERROR: test_iteritems (test.test_mailbox.TestMH)
----------------------------------------------------------------------
Traceback (most recent call last):
File "C:\buildbot\work\trunk.heller-windows\build\lib\test\test_mailbox.py", line 57, in setUp
self._delete_recursively(self._path)
File "C:\buildbot\work\trunk.heller-windows\build\lib\test\test_mailbox.py", line 47, in _delete_recursively
os.remove(target)
WindowsError: [Error 32] The process cannot access the file because it is being used by another process: '@test'
======================================================================
ERROR: test_iterkeys (test.test_mailbox.TestMH)
----------------------------------------------------------------------
Traceback (most recent call last):
File "C:\buildbot\work\trunk.heller-windows\build\lib\test\test_mailbox.py", line 57, in setUp
self._delete_recursively(self._path)
File "C:\buildbot\work\trunk.heller-windows\build\lib\test\test_mailbox.py", line 47, in _delete_recursively
os.remove(target)
WindowsError: [Error 32] The process cannot access the file because it is being used by another process: '@test'
======================================================================
ERROR: test_itervalues (test.test_mailbox.TestMH)
----------------------------------------------------------------------
Traceback (most recent call last):
File "C:\buildbot\work\trunk.heller-windows\build\lib\test\test_mailbox.py", line 57, in setUp
self._delete_recursively(self._path)
File "C:\buildbot\work\trunk.heller-windows\build\lib\test\test_mailbox.py", line 47, in _delete_recursively
os.remove(target)
WindowsError: [Error 32] The process cannot access the file because it is being used by another process: '@test'
======================================================================
ERROR: test_keys (test.test_mailbox.TestMH)
----------------------------------------------------------------------
Traceback (most recent call last):
File "C:\buildbot\work\trunk.heller-windows\build\lib\test\test_mailbox.py", line 57, in setUp
self._delete_recursively(self._path)
File "C:\buildbot\work\trunk.heller-windows\build\lib\test\test_mailbox.py", line 47, in _delete_recursively
os.remove(target)
WindowsError: [Error 32] The process cannot access the file because it is being used by another process: '@test'
======================================================================
ERROR: test_len (test.test_mailbox.TestMH)
----------------------------------------------------------------------
Traceback (most recent call last):
File "C:\buildbot\work\trunk.heller-windows\build\lib\test\test_mailbox.py", line 57, in setUp
self._delete_recursively(self._path)
File "C:\buildbot\work\trunk.heller-windows\build\lib\test\test_mailbox.py", line 47, in _delete_recursively
os.remove(target)
WindowsError: [Error 32] The process cannot access the file because it is being used by another process: '@test'
======================================================================
ERROR: test_list_folders (test.test_mailbox.TestMH)
----------------------------------------------------------------------
Traceback (most recent call last):
File "C:\buildbot\work\trunk.heller-windows\build\lib\test\test_mailbox.py", line 57, in setUp
self._delete_recursively(self._path)
File "C:\buildbot\work\trunk.heller-windows\build\lib\test\test_mailbox.py", line 47, in _delete_recursively
os.remove(target)
WindowsError: [Error 32] The process cannot access the file because it is being used by another process: '@test'
======================================================================
ERROR: test_lock_unlock (test.test_mailbox.TestMH)
----------------------------------------------------------------------
Traceback (most recent call last):
File "C:\buildbot\work\trunk.heller-windows\build\lib\test\test_mailbox.py", line 57, in setUp
self._delete_recursively(self._path)
File "C:\buildbot\work\trunk.heller-windows\build\lib\test\test_mailbox.py", line 47, in _delete_recursively
os.remove(target)
WindowsError: [Error 32] The process cannot access the file because it is being used by another process: '@test'
======================================================================
ERROR: test_pack (test.test_mailbox.TestMH)
----------------------------------------------------------------------
Traceback (most recent call last):
File "C:\buildbot\work\trunk.heller-windows\build\lib\test\test_mailbox.py", line 57, in setUp
self._delete_recursively(self._path)
File "C:\buildbot\work\trunk.heller-windows\build\lib\test\test_mailbox.py", line 47, in _delete_recursively
os.remove(target)
WindowsError: [Error 32] The process cannot access the file because it is being used by another process: '@test'
======================================================================
ERROR: test_pop (test.test_mailbox.TestMH)
----------------------------------------------------------------------
Traceback (most recent call last):
File "C:\buildbot\work\trunk.heller-windows\build\lib\test\test_mailbox.py", line 57, in setUp
self._delete_recursively(self._path)
File "C:\buildbot\work\trunk.heller-windows\build\lib\test\test_mailbox.py", line 47, in _delete_recursively
os.remove(target)
WindowsError: [Error 32] The process cannot access the file because it is being used by another process: '@test'
======================================================================
ERROR: test_popitem (test.test_mailbox.TestMH)
----------------------------------------------------------------------
Traceback (most recent call last):
File "C:\buildbot\work\trunk.heller-windows\build\lib\test\test_mailbox.py", line 57, in setUp
self._delete_recursively(self._path)
File "C:\buildbot\work\trunk.heller-windows\build\lib\test\test_mailbox.py", line 47, in _delete_recursively
os.remove(target)
WindowsError: [Error 32] The process cannot access the file because it is being used by another process: '@test'
======================================================================
ERROR: test_remove (test.test_mailbox.TestMH)
----------------------------------------------------------------------
Traceback (most recent call last):
File "C:\buildbot\work\trunk.heller-windows\build\lib\test\test_mailbox.py", line 57, in setUp
self._delete_recursively(self._path)
File "C:\buildbot\work\trunk.heller-windows\build\lib\test\test_mailbox.py", line 47, in _delete_recursively
os.remove(target)
WindowsError: [Error 32] The process cannot access the file because it is being used by another process: '@test'
======================================================================
ERROR: test_sequences (test.test_mailbox.TestMH)
----------------------------------------------------------------------
Traceback (most recent call last):
File "C:\buildbot\work\trunk.heller-windows\build\lib\test\test_mailbox.py", line 57, in setUp
self._delete_recursively(self._path)
File "C:\buildbot\work\trunk.heller-windows\build\lib\test\test_mailbox.py", line 47, in _delete_recursively
os.remove(target)
WindowsError: [Error 32] The process cannot access the file because it is being used by another process: '@test'
======================================================================
ERROR: test_set_item (test.test_mailbox.TestMH)
----------------------------------------------------------------------
Traceback (most recent call last):
File "C:\buildbot\work\trunk.heller-windows\build\lib\test\test_mailbox.py", line 57, in setUp
self._delete_recursively(self._path)
File "C:\buildbot\work\trunk.heller-windows\build\lib\test\test_mailbox.py", line 47, in _delete_recursively
os.remove(target)
WindowsError: [Error 32] The process cannot access the file because it is being used by another process: '@test'
======================================================================
ERROR: test_update (test.test_mailbox.TestMH)
----------------------------------------------------------------------
Traceback (most recent call last):
File "C:\buildbot\work\trunk.heller-windows\build\lib\test\test_mailbox.py", line 57, in setUp
self._delete_recursively(self._path)
File "C:\buildbot\work\trunk.heller-windows\build\lib\test\test_mailbox.py", line 47, in _delete_recursively
os.remove(target)
WindowsError: [Error 32] The process cannot access the file because it is being used by another process: '@test'
======================================================================
ERROR: test_values (test.test_mailbox.TestMH)
----------------------------------------------------------------------
Traceback (most recent call last):
File "C:\buildbot\work\trunk.heller-windows\build\lib\test\test_mailbox.py", line 57, in setUp
self._delete_recursively(self._path)
File "C:\buildbot\work\trunk.heller-windows\build\lib\test\test_mailbox.py", line 47, in _delete_recursively
os.remove(target)
WindowsError: [Error 32] The process cannot access the file because it is being used by another process: '@test'
======================================================================
ERROR: test_add (test.test_mailbox.TestBabyl)
----------------------------------------------------------------------
Traceback (most recent call last):
File "C:\buildbot\work\trunk.heller-windows\build\lib\test\test_mailbox.py", line 57, in setUp
self._delete_recursively(self._path)
File "C:\buildbot\work\trunk.heller-windows\build\lib\test\test_mailbox.py", line 47, in _delete_recursively
os.remove(target)
WindowsError: [Error 32] The process cannot access the file because it is being used by another process: '@test'
======================================================================
ERROR: test_clear (test.test_mailbox.TestBabyl)
----------------------------------------------------------------------
Traceback (most recent call last):
File "C:\buildbot\work\trunk.heller-windows\build\lib\test\test_mailbox.py", line 57, in setUp
self._delete_recursively(self._path)
File "C:\buildbot\work\trunk.heller-windows\build\lib\test\test_mailbox.py", line 47, in _delete_recursively
os.remove(target)
WindowsError: [Error 32] The process cannot access the file because it is being used by another process: '@test'
======================================================================
ERROR: test_close (test.test_mailbox.TestBabyl)
----------------------------------------------------------------------
Traceback (most recent call last):
File "C:\buildbot\work\trunk.heller-windows\build\lib\test\test_mailbox.py", line 57, in setUp
self._delete_recursively(self._path)
File "C:\buildbot\work\trunk.heller-windows\build\lib\test\test_mailbox.py", line 47, in _delete_recursively
os.remove(target)
WindowsError: [Error 32] The process cannot access the file because it is being used by another process: '@test'
======================================================================
ERROR: test_contains (test.test_mailbox.TestBabyl)
----------------------------------------------------------------------
Traceback (most recent call last):
File "C:\buildbot\work\trunk.heller-windows\build\lib\test\test_mailbox.py", line 57, in setUp
self._delete_recursively(self._path)
File "C:\buildbot\work\trunk.heller-windows\build\lib\test\test_mailbox.py", line 47, in _delete_recursively
os.remove(target)
WindowsError: [Error 32] The process cannot access the file because it is being used by another process: '@test'
======================================================================
ERROR: test_delitem (test.test_mailbox.TestBabyl)
----------------------------------------------------------------------
Traceback (most recent call last):
File "C:\buildbot\work\trunk.heller-windows\build\lib\test\test_mailbox.py", line 57, in setUp
self._delete_recursively(self._path)
File "C:\buildbot\work\trunk.heller-windows\build\lib\test\test_mailbox.py", line 47, in _delete_recursively
os.remove(target)
WindowsError: [Error 32] The process cannot access the file because it is being used by another process: '@test'
======================================================================
ERROR: test_discard (test.test_mailbox.TestBabyl)
----------------------------------------------------------------------
Traceback (most recent call last):
File "C:\buildbot\work\trunk.heller-windows\build\lib\test\test_mailbox.py", line 57, in setUp
self._delete_recursively(self._path)
File "C:\buildbot\work\trunk.heller-windows\build\lib\test\test_mailbox.py", line 47, in _delete_recursively
os.remove(target)
WindowsError: [Error 32] The process cannot access the file because it is being used by another process: '@test'
======================================================================
ERROR: test_dump_message (test.test_mailbox.TestBabyl)
----------------------------------------------------------------------
Traceback (most recent call last):
File "C:\buildbot\work\trunk.heller-windows\build\lib\test\test_mailbox.py", line 57, in setUp
self._delete_recursively(self._path)
File "C:\buildbot\work\trunk.heller-windows\build\lib\test\test_mailbox.py", line 47, in _delete_recursively
os.remove(target)
WindowsError: [Error 32] The process cannot access the file because it is being used by another process: '@test'
======================================================================
ERROR: test_flush (test.test_mailbox.TestBabyl)
----------------------------------------------------------------------
Traceback (most recent call last):
File "C:\buildbot\work\trunk.heller-windows\build\lib\test\test_mailbox.py", line 57, in setUp
self._delete_recursively(self._path)
File "C:\buildbot\work\trunk.heller-windows\build\lib\test\test_mailbox.py", line 47, in _delete_recursively
os.remove(target)
WindowsError: [Error 32] The process cannot access the file because it is being used by another process: '@test'
======================================================================
ERROR: test_get (test.test_mailbox.TestBabyl)
----------------------------------------------------------------------
Traceback (most recent call last):
File "C:\buildbot\work\trunk.heller-windows\build\lib\test\test_mailbox.py", line 57, in setUp
self._delete_recursively(self._path)
File "C:\buildbot\work\trunk.heller-windows\build\lib\test\test_mailbox.py", line 47, in _delete_recursively
os.remove(target)
WindowsError: [Error 32] The process cannot access the file because it is being used by another process: '@test'
======================================================================
ERROR: test_get_file (test.test_mailbox.TestBabyl)
----------------------------------------------------------------------
Traceback (most recent call last):
File "C:\buildbot\work\trunk.heller-windows\build\lib\test\test_mailbox.py", line 57, in setUp
self._delete_recursively(self._path)
File "C:\buildbot\work\trunk.heller-windows\build\lib\test\test_mailbox.py", line 47, in _delete_recursively
os.remove(target)
WindowsError: [Error 32] The process cannot access the file because it is being used by another process: '@test'
======================================================================
ERROR: test_get_message (test.test_mailbox.TestBabyl)
----------------------------------------------------------------------
Traceback (most recent call last):
File "C:\buildbot\work\trunk.heller-windows\build\lib\test\test_mailbox.py", line 57, in setUp
self._delete_recursively(self._path)
File "C:\buildbot\work\trunk.heller-windows\build\lib\test\test_mailbox.py", line 47, in _delete_recursively
os.remove(target)
WindowsError: [Error 32] The process cannot access the file because it is being used by another process: '@test'
======================================================================
ERROR: test_get_string (test.test_mailbox.TestBabyl)
----------------------------------------------------------------------
Traceback (most recent call last):
File "C:\buildbot\work\trunk.heller-windows\build\lib\test\test_mailbox.py", line 57, in setUp
self._delete_recursively(self._path)
File "C:\buildbot\work\trunk.heller-windows\build\lib\test\test_mailbox.py", line 47, in _delete_recursively
os.remove(target)
WindowsError: [Error 32] The process cannot access the file because it is being used by another process: '@test'
======================================================================
ERROR: test_getitem (test.test_mailbox.TestBabyl)
----------------------------------------------------------------------
Traceback (most recent call last):
File "C:\buildbot\work\trunk.heller-windows\build\lib\test\test_mailbox.py", line 57, in setUp
self._delete_recursively(self._path)
File "C:\buildbot\work\trunk.heller-windows\build\lib\test\test_mailbox.py", line 47, in _delete_recursively
os.remove(target)
WindowsError: [Error 32] The process cannot access the file because it is being used by another process: '@test'
======================================================================
ERROR: test_items (test.test_mailbox.TestBabyl)
----------------------------------------------------------------------
Traceback (most recent call last):
File "C:\buildbot\work\trunk.heller-windows\build\lib\test\test_mailbox.py", line 57, in setUp
self._delete_recursively(self._path)
File "C:\buildbot\work\trunk.heller-windows\build\lib\test\test_mailbox.py", line 47, in _delete_recursively
os.remove(target)
WindowsError: [Error 32] The process cannot access the file because it is being used by another process: '@test'
======================================================================
ERROR: test_iter (test.test_mailbox.TestBabyl)
----------------------------------------------------------------------
Traceback (most recent call last):
File "C:\buildbot\work\trunk.heller-windows\build\lib\test\test_mailbox.py", line 57, in setUp
self._delete_recursively(self._path)
File "C:\buildbot\work\trunk.heller-windows\build\lib\test\test_mailbox.py", line 47, in _delete_recursively
os.remove(target)
WindowsError: [Error 32] The process cannot access the file because it is being used by another process: '@test'
======================================================================
ERROR: test_iteritems (test.test_mailbox.TestBabyl)
----------------------------------------------------------------------
Traceback (most recent call last):
File "C:\buildbot\work\trunk.heller-windows\build\lib\test\test_mailbox.py", line 57, in setUp
self._delete_recursively(self._path)
File "C:\buildbot\work\trunk.heller-windows\build\lib\test\test_mailbox.py", line 47, in _delete_recursively
os.remove(target)
WindowsError: [Error 32] The process cannot access the file because it is being used by another process: '@test'
======================================================================
ERROR: test_iterkeys (test.test_mailbox.TestBabyl)
----------------------------------------------------------------------
Traceback (most recent call last):
File "C:\buildbot\work\trunk.heller-windows\build\lib\test\test_mailbox.py", line 57, in setUp
self._delete_recursively(self._path)
File "C:\buildbot\work\trunk.heller-windows\build\lib\test\test_mailbox.py", line 47, in _delete_recursively
os.remove(target)
WindowsError: [Error 32] The process cannot access the file because it is being used by another process: '@test'
======================================================================
ERROR: test_itervalues (test.test_mailbox.TestBabyl)
----------------------------------------------------------------------
Traceback (most recent call last):
File "C:\buildbot\work\trunk.heller-windows\build\lib\test\test_mailbox.py", line 57, in setUp
self._delete_recursively(self._path)
File "C:\buildbot\work\trunk.heller-windows\build\lib\test\test_mailbox.py", line 47, in _delete_recursively
os.remove(target)
WindowsError: [Error 32] The process cannot access the file because it is being used by another process: '@test'
======================================================================
ERROR: test_keys (test.test_mailbox.TestBabyl)
----------------------------------------------------------------------
Traceback (most recent call last):
File "C:\buildbot\work\trunk.heller-windows\build\lib\test\test_mailbox.py", line 57, in setUp
self._delete_recursively(self._path)
File "C:\buildbot\work\trunk.heller-windows\build\lib\test\test_mailbox.py", line 47, in _delete_recursively
os.remove(target)
WindowsError: [Error 32] The process cannot access the file because it is being used by another process: '@test'
======================================================================
ERROR: test_labels (test.test_mailbox.TestBabyl)
----------------------------------------------------------------------
Traceback (most recent call last):
File "C:\buildbot\work\trunk.heller-windows\build\lib\test\test_mailbox.py", line 57, in setUp
self._delete_recursively(self._path)
File "C:\buildbot\work\trunk.heller-windows\build\lib\test\test_mailbox.py", line 47, in _delete_recursively
os.remove(target)
WindowsError: [Error 32] The process cannot access the file because it is being used by another process: '@test'
======================================================================
ERROR: test_len (test.test_mailbox.TestBabyl)
----------------------------------------------------------------------
Traceback (most recent call last):
File "C:\buildbot\work\trunk.heller-windows\build\lib\test\test_mailbox.py", line 57, in setUp
self._delete_recursively(self._path)
File "C:\buildbot\work\trunk.heller-windows\build\lib\test\test_mailbox.py", line 47, in _delete_recursively
os.remove(target)
WindowsError: [Error 32] The process cannot access the file because it is being used by another process: '@test'
======================================================================
ERROR: test_lock_unlock (test.test_mailbox.TestBabyl)
----------------------------------------------------------------------
Traceback (most recent call last):
File "C:\buildbot\work\trunk.heller-windows\build\lib\test\test_mailbox.py", line 57, in setUp
self._delete_recursively(self._path)
File "C:\buildbot\work\trunk.heller-windows\build\lib\test\test_mailbox.py", line 47, in _delete_recursively
os.remove(target)
WindowsError: [Error 32] The process cannot access the file because it is being used by another process: '@test'
======================================================================
ERROR: test_pop (test.test_mailbox.TestBabyl)
----------------------------------------------------------------------
Traceback (most recent call last):
File "C:\buildbot\work\trunk.heller-windows\build\lib\test\test_mailbox.py", line 57, in setUp
self._delete_recursively(self._path)
File "C:\buildbot\work\trunk.heller-windows\build\lib\test\test_mailbox.py", line 47, in _delete_recursively
os.remove(target)
WindowsError: [Error 32] The process cannot access the file because it is being used by another process: '@test'
======================================================================
ERROR: test_popitem (test.test_mailbox.TestBabyl)
----------------------------------------------------------------------
Traceback (most recent call last):
File "C:\buildbot\work\trunk.heller-windows\build\lib\test\test_mailbox.py", line 57, in setUp
self._delete_recursively(self._path)
File "C:\buildbot\work\trunk.heller-windows\build\lib\test\test_mailbox.py", line 47, in _delete_recursively
os.remove(target)
WindowsError: [Error 32] The process cannot access the file because it is being used by another process: '@test'
======================================================================
ERROR: test_remove (test.test_mailbox.TestBabyl)
----------------------------------------------------------------------
Traceback (most recent call last):
File "C:\buildbot\work\trunk.heller-windows\build\lib\test\test_mailbox.py", line 57, in setUp
self._delete_recursively(self._path)
File "C:\buildbot\work\trunk.heller-windows\build\lib\test\test_mailbox.py", line 47, in _delete_recursively
os.remove(target)
WindowsError: [Error 32] The process cannot access the file because it is being used by another process: '@test'
======================================================================
ERROR: test_set_item (test.test_mailbox.TestBabyl)
----------------------------------------------------------------------
Traceback (most recent call last):
File "C:\buildbot\work\trunk.heller-windows\build\lib\test\test_mailbox.py", line 57, in setUp
self._delete_recursively(self._path)
File "C:\buildbot\work\trunk.heller-windows\build\lib\test\test_mailbox.py", line 47, in _delete_recursively
os.remove(target)
WindowsError: [Error 32] The process cannot access the file because it is being used by another process: '@test'
======================================================================
ERROR: test_update (test.test_mailbox.TestBabyl)
----------------------------------------------------------------------
Traceback (most recent call last):
File "C:\buildbot\work\trunk.heller-windows\build\lib\test\test_mailbox.py", line 57, in setUp
self._delete_recursively(self._path)
File "C:\buildbot\work\trunk.heller-windows\build\lib\test\test_mailbox.py", line 47, in _delete_recursively
os.remove(target)
WindowsError: [Error 32] The process cannot access the file because it is being used by another process: '@test'
======================================================================
ERROR: test_values (test.test_mailbox.TestBabyl)
----------------------------------------------------------------------
Traceback (most recent call last):
File "C:\buildbot\work\trunk.heller-windows\build\lib\test\test_mailbox.py", line 57, in setUp
self._delete_recursively(self._path)
File "C:\buildbot\work\trunk.heller-windows\build\lib\test\test_mailbox.py", line 47, in _delete_recursively
os.remove(target)
WindowsError: [Error 32] The process cannot access the file because it is being used by another process: '@test'
======================================================================
ERROR: test_become_message (test.test_mailbox.TestMessage)
----------------------------------------------------------------------
Traceback (most recent call last):
File "C:\buildbot\work\trunk.heller-windows\build\lib\test\test_mailbox.py", line 950, in tearDown
self._delete_recursively(self._path)
File "C:\buildbot\work\trunk.heller-windows\build\lib\test\test_mailbox.py", line 47, in _delete_recursively
os.remove(target)
WindowsError: [Error 32] The process cannot access the file because it is being used by another process: '@test'
======================================================================
ERROR: test_explain_to (test.test_mailbox.TestMessage)
----------------------------------------------------------------------
Traceback (most recent call last):
File "C:\buildbot\work\trunk.heller-windows\build\lib\test\test_mailbox.py", line 950, in tearDown
self._delete_recursively(self._path)
File "C:\buildbot\work\trunk.heller-windows\build\lib\test\test_mailbox.py", line 47, in _delete_recursively
os.remove(target)
WindowsError: [Error 32] The process cannot access the file because it is being used by another process: '@test'
======================================================================
ERROR: test_initialize_incorrectly (test.test_mailbox.TestMessage)
----------------------------------------------------------------------
Traceback (most recent call last):
File "C:\buildbot\work\trunk.heller-windows\build\lib\test\test_mailbox.py", line 950, in tearDown
self._delete_recursively(self._path)
File "C:\buildbot\work\trunk.heller-windows\build\lib\test\test_mailbox.py", line 47, in _delete_recursively
os.remove(target)
WindowsError: [Error 32] The process cannot access the file because it is being used by another process: '@test'
======================================================================
ERROR: test_initialize_with_eMM (test.test_mailbox.TestMessage)
----------------------------------------------------------------------
Traceback (most recent call last):
File "C:\buildbot\work\trunk.heller-windows\build\lib\test\test_mailbox.py", line 950, in tearDown
self._delete_recursively(self._path)
File "C:\buildbot\work\trunk.heller-windows\build\lib\test\test_mailbox.py", line 47, in _delete_recursively
os.remove(target)
WindowsError: [Error 32] The process cannot access the file because it is being used by another process: '@test'
======================================================================
ERROR: test_initialize_with_file (test.test_mailbox.TestMessage)
----------------------------------------------------------------------
Traceback (most recent call last):
File "C:\buildbot\work\trunk.heller-windows\build\lib\test\test_mailbox.py", line 950, in tearDown
self._delete_recursively(self._path)
File "C:\buildbot\work\trunk.heller-windows\build\lib\test\test_mailbox.py", line 47, in _delete_recursively
os.remove(target)
WindowsError: [Error 32] The process cannot access the file because it is being used by another process: '@test'
======================================================================
ERROR: test_initialize_with_nothing (test.test_mailbox.TestMessage)
----------------------------------------------------------------------
Traceback (most recent call last):
File "C:\buildbot\work\trunk.heller-windows\build\lib\test\test_mailbox.py", line 950, in tearDown
self._delete_recursively(self._path)
File "C:\buildbot\work\trunk.heller-windows\build\lib\test\test_mailbox.py", line 47, in _delete_recursively
os.remove(target)
WindowsError: [Error 32] The process cannot access the file because it is being used by another process: '@test'
======================================================================
ERROR: test_initialize_with_string (test.test_mailbox.TestMessage)
----------------------------------------------------------------------
Traceback (most recent call last):
File "C:\buildbot\work\trunk.heller-windows\build\lib\test\test_mailbox.py", line 950, in tearDown
self._delete_recursively(self._path)
File "C:\buildbot\work\trunk.heller-windows\build\lib\test\test_mailbox.py", line 47, in _delete_recursively
os.remove(target)
WindowsError: [Error 32] The process cannot access the file because it is being used by another process: '@test'
======================================================================
ERROR: test_become_message (test.test_mailbox.TestMaildirMessage)
----------------------------------------------------------------------
Traceback (most recent call last):
File "C:\buildbot\work\trunk.heller-windows\build\lib\test\test_mailbox.py", line 950, in tearDown
self._delete_recursively(self._path)
File "C:\buildbot\work\trunk.heller-windows\build\lib\test\test_mailbox.py", line 47, in _delete_recursively
os.remove(target)
WindowsError: [Error 32] The process cannot access the file because it is being used by another process: '@test'
======================================================================
ERROR: test_date (test.test_mailbox.TestMaildirMessage)
----------------------------------------------------------------------
Traceback (most recent call last):
File "C:\buildbot\work\trunk.heller-windows\build\lib\test\test_mailbox.py", line 950, in tearDown
self._delete_recursively(self._path)
File "C:\buildbot\work\trunk.heller-windows\build\lib\test\test_mailbox.py", line 47, in _delete_recursively
os.remove(target)
WindowsError: [Error 32] The process cannot access the file because it is being used by another process: '@test'
======================================================================
ERROR: test_explain_to (test.test_mailbox.TestMaildirMessage)
----------------------------------------------------------------------
Traceback (most recent call last):
File "C:\buildbot\work\trunk.heller-windows\build\lib\test\test_mailbox.py", line 950, in tearDown
self._delete_recursively(self._path)
File "C:\buildbot\work\trunk.heller-windows\build\lib\test\test_mailbox.py", line 47, in _delete_recursively
os.remove(target)
WindowsError: [Error 32] The process cannot access the file because it is being used by another process: '@test'
======================================================================
ERROR: test_flags (test.test_mailbox.TestMaildirMessage)
----------------------------------------------------------------------
Traceback (most recent call last):
File "C:\buildbot\work\trunk.heller-windows\build\lib\test\test_mailbox.py", line 950, in tearDown
self._delete_recursively(self._path)
File "C:\buildbot\work\trunk.heller-windows\build\lib\test\test_mailbox.py", line 47, in _delete_recursively
os.remove(target)
WindowsError: [Error 32] The process cannot access the file because it is being used by another process: '@test'
======================================================================
ERROR: test_info (test.test_mailbox.TestMaildirMessage)
----------------------------------------------------------------------
Traceback (most recent call last):
File "C:\buildbot\work\trunk.heller-windows\build\lib\test\test_mailbox.py", line 950, in tearDown
self._delete_recursively(self._path)
File "C:\buildbot\work\trunk.heller-windows\build\lib\test\test_mailbox.py", line 47, in _delete_recursively
os.remove(target)
WindowsError: [Error 32] The process cannot access the file because it is being used by another process: '@test'
======================================================================
ERROR: test_info_and_flags (test.test_mailbox.TestMaildirMessage)
----------------------------------------------------------------------
Traceback (most recent call last):
File "C:\buildbot\work\trunk.heller-windows\build\lib\test\test_mailbox.py", line 950, in tearDown
self._delete_recursively(self._path)
File "C:\buildbot\work\trunk.heller-windows\build\lib\test\test_mailbox.py", line 47, in _delete_recursively
os.remove(target)
WindowsError: [Error 32] The process cannot access the file because it is being used by another process: '@test'
======================================================================
ERROR: test_initialize_incorrectly (test.test_mailbox.TestMaildirMessage)
----------------------------------------------------------------------
Traceback (most recent call last):
File "C:\buildbot\work\trunk.heller-windows\build\lib\test\test_mailbox.py", line 950, in tearDown
self._delete_recursively(self._path)
File "C:\buildbot\work\trunk.heller-windows\build\lib\test\test_mailbox.py", line 47, in _delete_recursively
os.remove(target)
WindowsError: [Error 32] The process cannot access the file because it is being used by another process: '@test'
======================================================================
ERROR: test_initialize_with_eMM (test.test_mailbox.TestMaildirMessage)
----------------------------------------------------------------------
Traceback (most recent call last):
File "C:\buildbot\work\trunk.heller-windows\build\lib\test\test_mailbox.py", line 950, in tearDown
self._delete_recursively(self._path)
File "C:\buildbot\work\trunk.heller-windows\build\lib\test\test_mailbox.py", line 47, in _delete_recursively
os.remove(target)
WindowsError: [Error 32] The process cannot access the file because it is being used by another process: '@test'
======================================================================
ERROR: test_initialize_with_file (test.test_mailbox.TestMaildirMessage)
----------------------------------------------------------------------
Traceback (most recent call last):
File "C:\buildbot\work\trunk.heller-windows\build\lib\test\test_mailbox.py", line 950, in tearDown
self._delete_recursively(self._path)
File "C:\buildbot\work\trunk.heller-windows\build\lib\test\test_mailbox.py", line 47, in _delete_recursively
os.remove(target)
WindowsError: [Error 32] The process cannot access the file because it is being used by another process: '@test'
======================================================================
ERROR: test_initialize_with_nothing (test.test_mailbox.TestMaildirMessage)
----------------------------------------------------------------------
Traceback (most recent call last):
File "C:\buildbot\work\trunk.heller-windows\build\lib\test\test_mailbox.py", line 950, in tearDown
self._delete_recursively(self._path)
File "C:\buildbot\work\trunk.heller-windows\build\lib\test\test_mailbox.py", line 47, in _delete_recursively
os.remove(target)
WindowsError: [Error 32] The process cannot access the file because it is being used by another process: '@test'
======================================================================
ERROR: test_initialize_with_string (test.test_mailbox.TestMaildirMessage)
----------------------------------------------------------------------
Traceback (most recent call last):
File "C:\buildbot\work\trunk.heller-windows\build\lib\test\test_mailbox.py", line 950, in tearDown
self._delete_recursively(self._path)
File "C:\buildbot\work\trunk.heller-windows\build\lib\test\test_mailbox.py", line 47, in _delete_recursively
os.remove(target)
WindowsError: [Error 32] The process cannot access the file because it is being used by another process: '@test'
======================================================================
ERROR: test_subdir (test.test_mailbox.TestMaildirMessage)
----------------------------------------------------------------------
Traceback (most recent call last):
File "C:\buildbot\work\trunk.heller-windows\build\lib\test\test_mailbox.py", line 950, in tearDown
self._delete_recursively(self._path)
File "C:\buildbot\work\trunk.heller-windows\build\lib\test\test_mailbox.py", line 47, in _delete_recursively
os.remove(target)
WindowsError: [Error 32] The process cannot access the file because it is being used by another process: '@test'
======================================================================
ERROR: test_become_message (test.test_mailbox.TestMboxMessage)
----------------------------------------------------------------------
Traceback (most recent call last):
File "C:\buildbot\work\trunk.heller-windows\build\lib\test\test_mailbox.py", line 950, in tearDown
self._delete_recursively(self._path)
File "C:\buildbot\work\trunk.heller-windows\build\lib\test\test_mailbox.py", line 47, in _delete_recursively
os.remove(target)
WindowsError: [Error 32] The process cannot access the file because it is being used by another process: '@test'
======================================================================
ERROR: test_explain_to (test.test_mailbox.TestMboxMessage)
----------------------------------------------------------------------
Traceback (most recent call last):
File "C:\buildbot\work\trunk.heller-windows\build\lib\test\test_mailbox.py", line 950, in tearDown
self._delete_recursively(self._path)
File "C:\buildbot\work\trunk.heller-windows\build\lib\test\test_mailbox.py", line 47, in _delete_recursively
os.remove(target)
WindowsError: [Error 32] The process cannot access the file because it is being used by another process: '@test'
======================================================================
ERROR: test_flags (test.test_mailbox.TestMboxMessage)
----------------------------------------------------------------------
Traceback (most recent call last):
File "C:\buildbot\work\trunk.heller-windows\build\lib\test\test_mailbox.py", line 950, in tearDown
self._delete_recursively(self._path)
File "C:\buildbot\work\trunk.heller-windows\build\lib\test\test_mailbox.py", line 47, in _delete_recursively
os.remove(target)
WindowsError: [Error 32] The process cannot access the file because it is being used by another process: '@test'
======================================================================
ERROR: test_from (test.test_mailbox.TestMboxMessage)
----------------------------------------------------------------------
Traceback (most recent call last):
File "C:\buildbot\work\trunk.heller-windows\build\lib\test\test_mailbox.py", line 950, in tearDown
self._delete_recursively(self._path)
File "C:\buildbot\work\trunk.heller-windows\build\lib\test\test_mailbox.py", line 47, in _delete_recursively
os.remove(target)
WindowsError: [Error 32] The process cannot access the file because it is being used by another process: '@test'
======================================================================
ERROR: test_initialize_incorrectly (test.test_mailbox.TestMboxMessage)
----------------------------------------------------------------------
Traceback (most recent call last):
File "C:\buildbot\work\trunk.heller-windows\build\lib\test\test_mailbox.py", line 950, in tearDown
self._delete_recursively(self._path)
File "C:\buildbot\work\trunk.heller-windows\build\lib\test\test_mailbox.py", line 47, in _delete_recursively
os.remove(target)
WindowsError: [Error 32] The process cannot access the file because it is being used by another process: '@test'
======================================================================
ERROR: test_initialize_with_eMM (test.test_mailbox.TestMboxMessage)
----------------------------------------------------------------------
Traceback (most recent call last):
File "C:\buildbot\work\trunk.heller-windows\build\lib\test\test_mailbox.py", line 950, in tearDown
self._delete_recursively(self._path)
File "C:\buildbot\work\trunk.heller-windows\build\lib\test\test_mailbox.py", line 47, in _delete_recursively
os.remove(target)
WindowsError: [Error 32] The process cannot access the file because it is being used by another process: '@test'
======================================================================
ERROR: test_initialize_with_file (test.test_mailbox.TestMboxMessage)
----------------------------------------------------------------------
Traceback (most recent call last):
File "C:\buildbot\work\trunk.heller-windows\build\lib\test\test_mailbox.py", line 950, in tearDown
self._delete_recursively(self._path)
File "C:\buildbot\work\trunk.heller-windows\build\lib\test\test_mailbox.py", line 47, in _delete_recursively
os.remove(target)
WindowsError: [Error 32] The process cannot access the file because it is being used by another process: '@test'
======================================================================
ERROR: test_initialize_with_nothing (test.test_mailbox.TestMboxMessage)
----------------------------------------------------------------------
Traceback (most recent call last):
File "C:\buildbot\work\trunk.heller-windows\build\lib\test\test_mailbox.py", line 950, in tearDown
self._delete_recursively(self._path)
File "C:\buildbot\work\trunk.heller-windows\build\lib\test\test_mailbox.py", line 47, in _delete_recursively
os.remove(target)
WindowsError: [Error 32] The process cannot access the file because it is being used by another process: '@test'
======================================================================
ERROR: test_initialize_with_string (test.test_mailbox.TestMboxMessage)
----------------------------------------------------------------------
Traceback (most recent call last):
File "C:\buildbot\work\trunk.heller-windows\build\lib\test\test_mailbox.py", line 950, in tearDown
self._delete_recursively(self._path)
File "C:\buildbot\work\trunk.heller-windows\build\lib\test\test_mailbox.py", line 47, in _delete_recursively
os.remove(target)
WindowsError: [Error 32] The process cannot access the file because it is being used by another process: '@test'
======================================================================
ERROR: test_initialize_with_unixfrom (test.test_mailbox.TestMboxMessage)
----------------------------------------------------------------------
Traceback (most recent call last):
File "C:\buildbot\work\trunk.heller-windows\build\lib\test\test_mailbox.py", line 950, in tearDown
self._delete_recursively(self._path)
File "C:\buildbot\work\trunk.heller-windows\build\lib\test\test_mailbox.py", line 47, in _delete_recursively
os.remove(target)
WindowsError: [Error 32] The process cannot access the file because it is being used by another process: '@test'
======================================================================
ERROR: test_become_message (test.test_mailbox.TestMHMessage)
----------------------------------------------------------------------
Traceback (most recent call last):
File "C:\buildbot\work\trunk.heller-windows\build\lib\test\test_mailbox.py", line 950, in tearDown
self._delete_recursively(self._path)
File "C:\buildbot\work\trunk.heller-windows\build\lib\test\test_mailbox.py", line 47, in _delete_recursively
os.remove(target)
WindowsError: [Error 32] The process cannot access the file because it is being used by another process: '@test'
======================================================================
ERROR: test_explain_to (test.test_mailbox.TestMHMessage)
----------------------------------------------------------------------
Traceback (most recent call last):
File "C:\buildbot\work\trunk.heller-windows\build\lib\test\test_mailbox.py", line 950, in tearDown
self._delete_recursively(self._path)
File "C:\buildbot\work\trunk.heller-windows\build\lib\test\test_mailbox.py", line 47, in _delete_recursively
os.remove(target)
WindowsError: [Error 32] The process cannot access the file because it is being used by another process: '@test'
======================================================================
ERROR: test_initialize_incorrectly (test.test_mailbox.TestMHMessage)
----------------------------------------------------------------------
Traceback (most recent call last):
File "C:\buildbot\work\trunk.heller-windows\build\lib\test\test_mailbox.py", line 950, in tearDown
self._delete_recursively(self._path)
File "C:\buildbot\work\trunk.heller-windows\build\lib\test\test_mailbox.py", line 47, in _delete_recursively
os.remove(target)
WindowsError: [Error 32] The process cannot access the file because it is being used by another process: '@test'
======================================================================
ERROR: test_initialize_with_eMM (test.test_mailbox.TestMHMessage)
----------------------------------------------------------------------
Traceback (most recent call last):
File "C:\buildbot\work\trunk.heller-windows\build\lib\test\test_mailbox.py", line 950, in tearDown
self._delete_recursively(self._path)
File "C:\buildbot\work\trunk.heller-windows\build\lib\test\test_mailbox.py", line 47, in _delete_recursively
os.remove(target)
WindowsError: [Error 32] The process cannot access the file because it is being used by another process: '@test'
======================================================================
ERROR: test_initialize_with_file (test.test_mailbox.TestMHMessage)
----------------------------------------------------------------------
Traceback (most recent call last):
File "C:\buildbot\work\trunk.heller-windows\build\lib\test\test_mailbox.py", line 950, in tearDown
self._delete_recursively(self._path)
File "C:\buildbot\work\trunk.heller-windows\build\lib\test\test_mailbox.py", line 47, in _delete_recursively
os.remove(target)
WindowsError: [Error 32] The process cannot access the file because it is being used by another process: '@test'
======================================================================
ERROR: test_initialize_with_nothing (test.test_mailbox.TestMHMessage)
----------------------------------------------------------------------
Traceback (most recent call last):
File "C:\buildbot\work\trunk.heller-windows\build\lib\test\test_mailbox.py", line 950, in tearDown
self._delete_recursively(self._path)
File "C:\buildbot\work\trunk.heller-windows\build\lib\test\test_mailbox.py", line 47, in _delete_recursively
os.remove(target)
WindowsError: [Error 32] The process cannot access the file because it is being used by another process: '@test'
======================================================================
ERROR: test_initialize_with_string (test.test_mailbox.TestMHMessage)
----------------------------------------------------------------------
Traceback (most recent call last):
File "C:\buildbot\work\trunk.heller-windows\build\lib\test\test_mailbox.py", line 950, in tearDown
self._delete_recursively(self._path)
File "C:\buildbot\work\trunk.heller-windows\build\lib\test\test_mailbox.py", line 47, in _delete_recursively
os.remove(target)
WindowsError: [Error 32] The process cannot access the file because it is being used by another process: '@test'
======================================================================
ERROR: test_sequences (test.test_mailbox.TestMHMessage)
----------------------------------------------------------------------
Traceback (most recent call last):
File "C:\buildbot\work\trunk.heller-windows\build\lib\test\test_mailbox.py", line 950, in tearDown
self._delete_recursively(self._path)
File "C:\buildbot\work\trunk.heller-windows\build\lib\test\test_mailbox.py", line 47, in _delete_recursively
os.remove(target)
WindowsError: [Error 32] The process cannot access the file because it is being used by another process: '@test'
======================================================================
ERROR: test_become_message (test.test_mailbox.TestBabylMessage)
----------------------------------------------------------------------
Traceback (most recent call last):
File "C:\buildbot\work\trunk.heller-windows\build\lib\test\test_mailbox.py", line 950, in tearDown
self._delete_recursively(self._path)
File "C:\buildbot\work\trunk.heller-windows\build\lib\test\test_mailbox.py", line 47, in _delete_recursively
os.remove(target)
WindowsError: [Error 32] The process cannot access the file because it is being used by another process: '@test'
======================================================================
ERROR: test_explain_to (test.test_mailbox.TestBabylMessage)
----------------------------------------------------------------------
Traceback (most recent call last):
File "C:\buildbot\work\trunk.heller-windows\build\lib\test\test_mailbox.py", line 950, in tearDown
self._delete_recursively(self._path)
File "C:\buildbot\work\trunk.heller-windows\build\lib\test\test_mailbox.py", line 47, in _delete_recursively
os.remove(target)
WindowsError: [Error 32] The process cannot access the file because it is being used by another process: '@test'
======================================================================
ERROR: test_initialize_incorrectly (test.test_mailbox.TestBabylMessage)
----------------------------------------------------------------------
Traceback (most recent call last):
File "C:\buildbot\work\trunk.heller-windows\build\lib\test\test_mailbox.py", line 950, in tearDown
self._delete_recursively(self._path)
File "C:\buildbot\work\trunk.heller-windows\build\lib\test\test_mailbox.py", line 47, in _delete_recursively
os.remove(target)
WindowsError: [Error 32] The process cannot access the file because it is being used by another process: '@test'
======================================================================
ERROR: test_initialize_with_eMM (test.test_mailbox.TestBabylMessage)
----------------------------------------------------------------------
Traceback (most recent call last):
File "C:\buildbot\work\trunk.heller-windows\build\lib\test\test_mailbox.py", line 950, in tearDown
self._delete_recursively(self._path)
File "C:\buildbot\work\trunk.heller-windows\build\lib\test\test_mailbox.py", line 47, in _delete_recursively
os.remove(target)
WindowsError: [Error 32] The process cannot access the file because it is being used by another process: '@test'
======================================================================
ERROR: test_initialize_with_file (test.test_mailbox.TestBabylMessage)
----------------------------------------------------------------------
Traceback (most recent call last):
File "C:\buildbot\work\trunk.heller-windows\build\lib\test\test_mailbox.py", line 950, in tearDown
self._delete_recursively(self._path)
File "C:\buildbot\work\trunk.heller-windows\build\lib\test\test_mailbox.py", line 47, in _delete_recursively
os.remove(target)
WindowsError: [Error 32] The process cannot access the file because it is being used by another process: '@test'
======================================================================
ERROR: test_initialize_with_nothing (test.test_mailbox.TestBabylMessage)
----------------------------------------------------------------------
Traceback (most recent call last):
File "C:\buildbot\work\trunk.heller-windows\build\lib\test\test_mailbox.py", line 950, in tearDown
self._delete_recursively(self._path)
File "C:\buildbot\work\trunk.heller-windows\build\lib\test\test_mailbox.py", line 47, in _delete_recursively
os.remove(target)
WindowsError: [Error 32] The process cannot access the file because it is being used by another process: '@test'
======================================================================
ERROR: test_initialize_with_string (test.test_mailbox.TestBabylMessage)
----------------------------------------------------------------------
Traceback (most recent call last):
File "C:\buildbot\work\trunk.heller-windows\build\lib\test\test_mailbox.py", line 950, in tearDown
self._delete_recursively(self._path)
File "C:\buildbot\work\trunk.heller-windows\build\lib\test\test_mailbox.py", line 47, in _delete_recursively
os.remove(target)
WindowsError: [Error 32] The process cannot access the file because it is being used by another process: '@test'
======================================================================
ERROR: test_labels (test.test_mailbox.TestBabylMessage)
----------------------------------------------------------------------
Traceback (most recent call last):
File "C:\buildbot\work\trunk.heller-windows\build\lib\test\test_mailbox.py", line 950, in tearDown
self._delete_recursively(self._path)
File "C:\buildbot\work\trunk.heller-windows\build\lib\test\test_mailbox.py", line 47, in _delete_recursively
os.remove(target)
WindowsError: [Error 32] The process cannot access the file because it is being used by another process: '@test'
======================================================================
ERROR: test_visible (test.test_mailbox.TestBabylMessage)
----------------------------------------------------------------------
Traceback (most recent call last):
File "C:\buildbot\work\trunk.heller-windows\build\lib\test\test_mailbox.py", line 950, in tearDown
self._delete_recursively(self._path)
File "C:\buildbot\work\trunk.heller-windows\build\lib\test\test_mailbox.py", line 47, in _delete_recursively
os.remove(target)
WindowsError: [Error 32] The process cannot access the file because it is being used by another process: '@test'
======================================================================
ERROR: test_become_message (test.test_mailbox.TestMMDFMessage)
----------------------------------------------------------------------
Traceback (most recent call last):
File "C:\buildbot\work\trunk.heller-windows\build\lib\test\test_mailbox.py", line 950, in tearDown
self._delete_recursively(self._path)
File "C:\buildbot\work\trunk.heller-windows\build\lib\test\test_mailbox.py", line 47, in _delete_recursively
os.remove(target)
WindowsError: [Error 32] The process cannot access the file because it is being used by another process: '@test'
======================================================================
ERROR: test_explain_to (test.test_mailbox.TestMMDFMessage)
----------------------------------------------------------------------
Traceback (most recent call last):
File "C:\buildbot\work\trunk.heller-windows\build\lib\test\test_mailbox.py", line 950, in tearDown
self._delete_recursively(self._path)
File "C:\buildbot\work\trunk.heller-windows\build\lib\test\test_mailbox.py", line 47, in _delete_recursively
os.remove(target)
WindowsError: [Error 32] The process cannot access the file because it is being used by another process: '@test'
======================================================================
ERROR: test_flags (test.test_mailbox.TestMMDFMessage)
----------------------------------------------------------------------
Traceback (most recent call last):
File "C:\buildbot\work\trunk.heller-windows\build\lib\test\test_mailbox.py", line 950, in tearDown
self._delete_recursively(self._path)
File "C:\buildbot\work\trunk.heller-windows\build\lib\test\test_mailbox.py", line 47, in _delete_recursively
os.remove(target)
WindowsError: [Error 32] The process cannot access the file because it is being used by another process: '@test'
======================================================================
ERROR: test_from (test.test_mailbox.TestMMDFMessage)
----------------------------------------------------------------------
Traceback (most recent call last):
File "C:\buildbot\work\trunk.heller-windows\build\lib\test\test_mailbox.py", line 950, in tearDown
self._delete_recursively(self._path)
File "C:\buildbot\work\trunk.heller-windows\build\lib\test\test_mailbox.py", line 47, in _delete_recursively
os.remove(target)
WindowsError: [Error 32] The process cannot access the file because it is being used by another process: '@test'
======================================================================
ERROR: test_initialize_incorrectly (test.test_mailbox.TestMMDFMessage)
----------------------------------------------------------------------
Traceback (most recent call last):
File "C:\buildbot\work\trunk.heller-windows\build\lib\test\test_mailbox.py", line 950, in tearDown
self._delete_recursively(self._path)
File "C:\buildbot\work\trunk.heller-windows\build\lib\test\test_mailbox.py", line 47, in _delete_recursively
os.remove(target)
WindowsError: [Error 32] The process cannot access the file because it is being used by another process: '@test'
======================================================================
ERROR: test_initialize_with_eMM (test.test_mailbox.TestMMDFMessage)
----------------------------------------------------------------------
Traceback (most recent call last):
File "C:\buildbot\work\trunk.heller-windows\build\lib\test\test_mailbox.py", line 950, in tearDown
self._delete_recursively(self._path)
File "C:\buildbot\work\trunk.heller-windows\build\lib\test\test_mailbox.py", line 47, in _delete_recursively
os.remove(target)
WindowsError: [Error 32] The process cannot access the file because it is being used by another process: '@test'
======================================================================
ERROR: test_initialize_with_file (test.test_mailbox.TestMMDFMessage)
----------------------------------------------------------------------
Traceback (most recent call last):
File "C:\buildbot\work\trunk.heller-windows\build\lib\test\test_mailbox.py", line 950, in tearDown
self._delete_recursively(self._path)
File "C:\buildbot\work\trunk.heller-windows\build\lib\test\test_mailbox.py", line 47, in _delete_recursively
os.remove(target)
WindowsError: [Error 32] The process cannot access the file because it is being used by another process: '@test'
======================================================================
ERROR: test_initialize_with_nothing (test.test_mailbox.TestMMDFMessage)
----------------------------------------------------------------------
Traceback (most recent call last):
File "C:\buildbot\work\trunk.heller-windows\build\lib\test\test_mailbox.py", line 950, in tearDown
self._delete_recursively(self._path)
File "C:\buildbot\work\trunk.heller-windows\build\lib\test\test_mailbox.py", line 47, in _delete_recursively
os.remove(target)
WindowsError: [Error 32] The process cannot access the file because it is being used by another process: '@test'
======================================================================
ERROR: test_initialize_with_string (test.test_mailbox.TestMMDFMessage)
----------------------------------------------------------------------
Traceback (most recent call last):
File "C:\buildbot\work\trunk.heller-windows\build\lib\test\test_mailbox.py", line 950, in tearDown
self._delete_recursively(self._path)
File "C:\buildbot\work\trunk.heller-windows\build\lib\test\test_mailbox.py", line 47, in _delete_recursively
os.remove(target)
WindowsError: [Error 32] The process cannot access the file because it is being used by another process: '@test'
======================================================================
ERROR: test_initialize_with_unixfrom (test.test_mailbox.TestMMDFMessage)
----------------------------------------------------------------------
Traceback (most recent call last):
File "C:\buildbot\work\trunk.heller-windows\build\lib\test\test_mailbox.py", line 950, in tearDown
self._delete_recursively(self._path)
File "C:\buildbot\work\trunk.heller-windows\build\lib\test\test_mailbox.py", line 47, in _delete_recursively
os.remove(target)
WindowsError: [Error 32] The process cannot access the file because it is being used by another process: '@test'
======================================================================
ERROR: test_close (test.test_mailbox.TestProxyFile)
----------------------------------------------------------------------
Traceback (most recent call last):
File "C:\buildbot\work\trunk.heller-windows\build\lib\test\test_mailbox.py", line 1564, in tearDown
self._delete_recursively(self._path)
File "C:\buildbot\work\trunk.heller-windows\build\lib\test\test_mailbox.py", line 47, in _delete_recursively
os.remove(target)
WindowsError: [Error 32] The process cannot access the file because it is being used by another process: '@test'
======================================================================
ERROR: test_initialize (test.test_mailbox.TestProxyFile)
----------------------------------------------------------------------
Traceback (most recent call last):
File "C:\buildbot\work\trunk.heller-windows\build\lib\test\test_mailbox.py", line 1564, in tearDown
self._delete_recursively(self._path)
File "C:\buildbot\work\trunk.heller-windows\build\lib\test\test_mailbox.py", line 47, in _delete_recursively
os.remove(target)
WindowsError: [Error 32] The process cannot access the file because it is being used by another process: '@test'
======================================================================
ERROR: test_iteration (test.test_mailbox.TestProxyFile)
----------------------------------------------------------------------
Traceback (most recent call last):
File "C:\buildbot\work\trunk.heller-windows\build\lib\test\test_mailbox.py", line 1564, in tearDown
self._delete_recursively(self._path)
File "C:\buildbot\work\trunk.heller-windows\build\lib\test\test_mailbox.py", line 47, in _delete_recursively
os.remove(target)
WindowsError: [Error 32] The process cannot access the file because it is being used by another process: '@test'
======================================================================
ERROR: test_read (test.test_mailbox.TestProxyFile)
----------------------------------------------------------------------
Traceback (most recent call last):
File "C:\buildbot\work\trunk.heller-windows\build\lib\test\test_mailbox.py", line 1564, in tearDown
self._delete_recursively(self._path)
File "C:\buildbot\work\trunk.heller-windows\build\lib\test\test_mailbox.py", line 47, in _delete_recursively
os.remove(target)
WindowsError: [Error 32] The process cannot access the file because it is being used by another process: '@test'
======================================================================
ERROR: test_readline (test.test_mailbox.TestProxyFile)
----------------------------------------------------------------------
Traceback (most recent call last):
File "C:\buildbot\work\trunk.heller-windows\build\lib\test\test_mailbox.py", line 1564, in tearDown
self._delete_recursively(self._path)
File "C:\buildbot\work\trunk.heller-windows\build\lib\test\test_mailbox.py", line 47, in _delete_recursively
os.remove(target)
WindowsError: [Error 32] The process cannot access the file because it is being used by another process: '@test'
======================================================================
ERROR: test_readlines (test.test_mailbox.TestProxyFile)
----------------------------------------------------------------------
Traceback (most recent call last):
File "C:\buildbot\work\trunk.heller-windows\build\lib\test\test_mailbox.py", line 1564, in tearDown
self._delete_recursively(self._path)
File "C:\buildbot\work\trunk.heller-windows\build\lib\test\test_mailbox.py", line 47, in _delete_recursively
os.remove(target)
WindowsError: [Error 32] The process cannot access the file because it is being used by another process: '@test'
======================================================================
ERROR: test_seek_and_tell (test.test_mailbox.TestProxyFile)
----------------------------------------------------------------------
Traceback (most recent call last):
File "C:\buildbot\work\trunk.heller-windows\build\lib\test\test_mailbox.py", line 1564, in tearDown
self._delete_recursively(self._path)
File "C:\buildbot\work\trunk.heller-windows\build\lib\test\test_mailbox.py", line 47, in _delete_recursively
os.remove(target)
WindowsError: [Error 32] The process cannot access the file because it is being used by another process: '@test'
======================================================================
ERROR: test_close (test.test_mailbox.TestPartialFile)
----------------------------------------------------------------------
Traceback (most recent call last):
File "C:\buildbot\work\trunk.heller-windows\build\lib\test\test_mailbox.py", line 1613, in tearDown
self._delete_recursively(self._path)
File "C:\buildbot\work\trunk.heller-windows\build\lib\test\test_mailbox.py", line 47, in _delete_recursively
os.remove(target)
WindowsError: [Error 32] The process cannot access the file because it is being used by another process: '@test'
======================================================================
ERROR: test_initialize (test.test_mailbox.TestPartialFile)
----------------------------------------------------------------------
Traceback (most recent call last):
File "C:\buildbot\work\trunk.heller-windows\build\lib\test\test_mailbox.py", line 1613, in tearDown
self._delete_recursively(self._path)
File "C:\buildbot\work\trunk.heller-windows\build\lib\test\test_mailbox.py", line 47, in _delete_recursively
os.remove(target)
WindowsError: [Error 32] The process cannot access the file because it is being used by another process: '@test'
======================================================================
ERROR: test_iteration (test.test_mailbox.TestPartialFile)
----------------------------------------------------------------------
Traceback (most recent call last):
File "C:\buildbot\work\trunk.heller-windows\build\lib\test\test_mailbox.py", line 1613, in tearDown
self._delete_recursively(self._path)
File "C:\buildbot\work\trunk.heller-windows\build\lib\test\test_mailbox.py", line 47, in _delete_recursively
os.remove(target)
WindowsError: [Error 32] The process cannot access the file because it is being used by another process: '@test'
======================================================================
ERROR: test_read (test.test_mailbox.TestPartialFile)
----------------------------------------------------------------------
Traceback (most recent call last):
File "C:\buildbot\work\trunk.heller-windows\build\lib\test\test_mailbox.py", line 1613, in tearDown
self._delete_recursively(self._path)
File "C:\buildbot\work\trunk.heller-windows\build\lib\test\test_mailbox.py", line 47, in _delete_recursively
os.remove(target)
WindowsError: [Error 32] The process cannot access the file because it is being used by another process: '@test'
======================================================================
ERROR: test_readline (test.test_mailbox.TestPartialFile)
----------------------------------------------------------------------
Traceback (most recent call last):
File "C:\buildbot\work\trunk.heller-windows\build\lib\test\test_mailbox.py", line 1613, in tearDown
self._delete_recursively(self._path)
File "C:\buildbot\work\trunk.heller-windows\build\lib\test\test_mailbox.py", line 47, in _delete_recursively
os.remove(target)
WindowsError: [Error 32] The process cannot access the file because it is being used by another process: '@test'
======================================================================
ERROR: test_readlines (test.test_mailbox.TestPartialFile)
----------------------------------------------------------------------
Traceback (most recent call last):
File "C:\buildbot\work\trunk.heller-windows\build\lib\test\test_mailbox.py", line 1613, in tearDown
self._delete_recursively(self._path)
File "C:\buildbot\work\trunk.heller-windows\build\lib\test\test_mailbox.py", line 47, in _delete_recursively
os.remove(target)
WindowsError: [Error 32] The process cannot access the file because it is being used by another process: '@test'
======================================================================
ERROR: test_seek_and_tell (test.test_mailbox.TestPartialFile)
----------------------------------------------------------------------
Traceback (most recent call last):
File "C:\buildbot\work\trunk.heller-windows\build\lib\test\test_mailbox.py", line 1613, in tearDown
self._delete_recursively(self._path)
File "C:\buildbot\work\trunk.heller-windows\build\lib\test\test_mailbox.py", line 47, in _delete_recursively
os.remove(target)
WindowsError: [Error 32] The process cannot access the file because it is being used by another process: '@test'
======================================================================
ERROR: Test an empty maildir mailbox
----------------------------------------------------------------------
Traceback (most recent call last):
File "C:\buildbot\work\trunk.heller-windows\build\lib\test\test_mailbox.py", line 1672, in setUp
os.mkdir(self._dir)
WindowsError: [Error 183] Cannot create a file when that file already exists: '@test'
======================================================================
ERROR: test_nonempty_maildir_both (test.test_mailbox.MaildirTestCase)
----------------------------------------------------------------------
Traceback (most recent call last):
File "C:\buildbot\work\trunk.heller-windows\build\lib\test\test_mailbox.py", line 1672, in setUp
os.mkdir(self._dir)
WindowsError: [Error 183] Cannot create a file when that file already exists: '@test'
======================================================================
ERROR: test_nonempty_maildir_cur (test.test_mailbox.MaildirTestCase)
----------------------------------------------------------------------
Traceback (most recent call last):
File "C:\buildbot\work\trunk.heller-windows\build\lib\test\test_mailbox.py", line 1672, in setUp
os.mkdir(self._dir)
WindowsError: [Error 183] Cannot create a file when that file already exists: '@test'
======================================================================
ERROR: test_nonempty_maildir_new (test.test_mailbox.MaildirTestCase)
----------------------------------------------------------------------
Traceback (most recent call last):
File "C:\buildbot\work\trunk.heller-windows\build\lib\test\test_mailbox.py", line 1672, in setUp
os.mkdir(self._dir)
WindowsError: [Error 183] Cannot create a file when that file already exists: '@test'
======================================================================
ERROR: test_unix_mbox (test.test_mailbox.MaildirTestCase)
----------------------------------------------------------------------
Traceback (most recent call last):
File "C:\buildbot\work\trunk.heller-windows\build\lib\test\test_mailbox.py", line 1672, in setUp
os.mkdir(self._dir)
WindowsError: [Error 183] Cannot create a file when that file already exists: '@test'
======================================================================
FAIL: test_dump_message (test.test_mailbox.TestMaildir)
----------------------------------------------------------------------
Traceback (most recent call last):
File "C:\buildbot\work\trunk.heller-windows\build\lib\test\test_mailbox.py", line 407, in test_dump_message
_sample_message.replace('\n', os.linesep))
AssertionError: None
======================================================================
FAIL: test_add (test.test_mailbox.TestMbox)
----------------------------------------------------------------------
Traceback (most recent call last):
File "C:\buildbot\work\trunk.heller-windows\build\lib\test\test_mailbox.py", line 76, in test_add
self.assertEqual(self._box.get_string(keys[0]), self._template % 0)
AssertionError: '\nFrom: foo\n\n0' != 'From: foo\n\n0'
======================================================================
ERROR: test_case_1 (test.test_netrc.NetrcTestCase)
----------------------------------------------------------------------
Traceback (most recent call last):
File "C:\buildbot\work\trunk.heller-windows\build\lib\test\test_netrc.py", line 31, in setUp
self.netrc = netrc.netrc(temp_filename)
File "C:\buildbot\work\trunk.heller-windows\build\lib\netrc.py", line 56, in __init__
"bad toplevel token %r" % tt, file, lexer.lineno)
netrc.NetrcParseError: bad toplevel token 'line1' (@test, line 9)
======================================================================
ERROR: test_directory (test.test_pep277.UnicodeFileTests)
----------------------------------------------------------------------
Traceback (most recent call last):
File "C:\buildbot\work\trunk.heller-windows\build\lib\test\test_pep277.py", line 40, in setUp
f.write((name+'\n').encode("utf-8"))
File "c:\buildbot\work\trunk.heller-windows\build\lib\io.py", line 1098, in write
s.__class__.__name__)
TypeError: can't write bytes to text stream
======================================================================
ERROR: test_failures (test.test_pep277.UnicodeFileTests)
----------------------------------------------------------------------
Traceback (most recent call last):
File "C:\buildbot\work\trunk.heller-windows\build\lib\test\test_pep277.py", line 40, in setUp
f.write((name+'\n').encode("utf-8"))
File "c:\buildbot\work\trunk.heller-windows\build\lib\io.py", line 1098, in write
s.__class__.__name__)
TypeError: can't write bytes to text stream
======================================================================
ERROR: test_listdir (test.test_pep277.UnicodeFileTests)
----------------------------------------------------------------------
Traceback (most recent call last):
File "C:\buildbot\work\trunk.heller-windows\build\lib\test\test_pep277.py", line 40, in setUp
f.write((name+'\n').encode("utf-8"))
File "c:\buildbot\work\trunk.heller-windows\build\lib\io.py", line 1098, in write
s.__class__.__name__)
TypeError: can't write bytes to text stream
======================================================================
ERROR: test_open (test.test_pep277.UnicodeFileTests)
----------------------------------------------------------------------
Traceback (most recent call last):
File "C:\buildbot\work\trunk.heller-windows\build\lib\test\test_pep277.py", line 40, in setUp
f.write((name+'\n').encode("utf-8"))
File "c:\buildbot\work\trunk.heller-windows\build\lib\io.py", line 1098, in write
s.__class__.__name__)
TypeError: can't write bytes to text stream
======================================================================
ERROR: test_rename (test.test_pep277.UnicodeFileTests)
----------------------------------------------------------------------
Traceback (most recent call last):
File "C:\buildbot\work\trunk.heller-windows\build\lib\test\test_pep277.py", line 40, in setUp
f.write((name+'\n').encode("utf-8"))
File "c:\buildbot\work\trunk.heller-windows\build\lib\io.py", line 1098, in write
s.__class__.__name__)
TypeError: can't write bytes to text stream
======================================================================
ERROR: test_communicate (test.test_subprocess.ProcessTestCase)
----------------------------------------------------------------------
Traceback (most recent call last):
File "C:\buildbot\work\trunk.heller-windows\build\lib\test\test_subprocess.py", line 303, in test_communicate
(stdout, stderr) = p.communicate("banana")
File "c:\buildbot\work\trunk.heller-windows\build\lib\subprocess.py", line 597, in communicate
return self._communicate(input)
File "c:\buildbot\work\trunk.heller-windows\build\lib\subprocess.py", line 812, in _communicate
self.stdin.write(input)
File "c:\buildbot\work\trunk.heller-windows\build\lib\io.py", line 807, in write
raise TypeError("can't write str to binary stream")
TypeError: can't write str to binary stream
======================================================================
ERROR: test_no_leaking (test.test_subprocess.ProcessTestCase)
----------------------------------------------------------------------
Traceback (most recent call last):
File "C:\buildbot\work\trunk.heller-windows\build\lib\test\test_subprocess.py", line 404, in test_no_leaking
data = p.communicate("lime")[0]
File "c:\buildbot\work\trunk.heller-windows\build\lib\subprocess.py", line 597, in communicate
return self._communicate(input)
File "c:\buildbot\work\trunk.heller-windows\build\lib\subprocess.py", line 812, in _communicate
self.stdin.write(input)
File "c:\buildbot\work\trunk.heller-windows\build\lib\io.py", line 807, in write
raise TypeError("can't write str to binary stream")
TypeError: can't write str to binary stream
======================================================================
ERROR: test_shell_sequence (test.test_subprocess.ProcessTestCase)
----------------------------------------------------------------------
Traceback (most recent call last):
File "C:\buildbot\work\trunk.heller-windows\build\lib\test\test_subprocess.py", line 633, in test_shell_sequence
self.assertNotEqual(p.stdout.read().find("physalis"), -1)
TypeError: Type str doesn't support the buffer API
======================================================================
ERROR: test_shell_string (test.test_subprocess.ProcessTestCase)
----------------------------------------------------------------------
Traceback (most recent call last):
File "C:\buildbot\work\trunk.heller-windows\build\lib\test\test_subprocess.py", line 642, in test_shell_string
self.assertNotEqual(p.stdout.read().find("physalis"), -1)
TypeError: Type str doesn't support the buffer API
======================================================================
FAIL: test_text_mode (test.test_tempfile.test_SpooledTemporaryFile)
----------------------------------------------------------------------
Traceback (most recent call last):
File "C:\buildbot\work\trunk.heller-windows\build\lib\test\test_tempfile.py", line 747, in test_text_mode
self.assertEqual(f.read(), "abc\ndef\nxyzzy\n")
AssertionError: 'abc\n\ndef\n\nxyzzy\n\n' != 'abc\ndef\nxyzzy\n'
======================================================================
ERROR: test_ftp (test.test_urllib2net.OtherNetworkTests)
----------------------------------------------------------------------
Traceback (most recent call last):
File "C:\buildbot\work\trunk.heller-windows\build\lib\test\test_urllib2net.py", line 173, in test_ftp
self._test_urls(urls, self._extra_handlers())
File "C:\buildbot\work\trunk.heller-windows\build\lib\test\test_urllib2net.py", line 242, in _test_urls
f = urllib2.urlopen(url, req)
File "C:\buildbot\work\trunk.heller-windows\build\lib\urllib2.py", line 122, in urlopen
return _opener.open(url, data, timeout)
File "C:\buildbot\work\trunk.heller-windows\build\lib\urllib2.py", line 378, in open
response = self._open(req, data)
File "C:\buildbot\work\trunk.heller-windows\build\lib\urllib2.py", line 396, in _open
'_open', req)
File "C:\buildbot\work\trunk.heller-windows\build\lib\urllib2.py", line 356, in _call_chain
result = func(*args)
File "C:\buildbot\work\trunk.heller-windows\build\lib\urllib2.py", line 1271, in ftp_open
fw = self.connect_ftp(user, passwd, host, port, dirs, req.timeout)
File "C:\buildbot\work\trunk.heller-windows\build\lib\urllib2.py", line 1316, in connect_ftp
self.cache[key] = ftpwrapper(user, passwd, host, port, dirs, timeout)
File "C:\buildbot\work\trunk.heller-windows\build\lib\urllib.py", line 785, in __init__
self.init()
File "C:\buildbot\work\trunk.heller-windows\build\lib\urllib.py", line 792, in init
self.ftp.login(self.user, self.passwd)
File "C:\buildbot\work\trunk.heller-windows\build\lib\ftplib.py", line 372, in login
if resp[0] == '3': resp = self.sendcmd('PASS ' + passwd)
File "C:\buildbot\work\trunk.heller-windows\build\lib\ftplib.py", line 242, in sendcmd
return self.getresp()
File "C:\buildbot\work\trunk.heller-windows\build\lib\ftplib.py", line 208, in getresp
resp = self.getmultiline()
File "C:\buildbot\work\trunk.heller-windows\build\lib\ftplib.py", line 198, in getmultiline
nextline = self.getline()
File "C:\buildbot\work\trunk.heller-windows\build\lib\ftplib.py", line 181, in getline
line = self.file.readline()
File "c:\buildbot\work\trunk.heller-windows\build\lib\io.py", line 1319, in readline
readahead, pending = self._read_chunk()
File "c:\buildbot\work\trunk.heller-windows\build\lib\io.py", line 1123, in _read_chunk
pending = self._decoder.decode(readahead, not readahead)
File "C:\buildbot\work\trunk.heller-windows\build\lib\encodings\ascii.py", line 26, in decode
return codecs.ascii_decode(input, self.errors)[0]
UnicodeDecodeError: 'ascii' codec can't decode byte 0xc3 in position 47: ordinal not in range(128)
sincerely,
-The Buildbot
1
0
r58252 - sandbox/trunk/urilib/TODO sandbox/trunk/urilib/test_urllib2.py sandbox/trunk/urilib/urllib2.py
by senthil.kumaran Sept. 25, 2007
by senthil.kumaran Sept. 25, 2007
Sept. 25, 2007
Author: senthil.kumaran
Date: Tue Sep 25 05:45:53 2007
New Revision: 58252
Added:
sandbox/trunk/urilib/TODO (contents, props changed)
Modified:
sandbox/trunk/urilib/test_urllib2.py
sandbox/trunk/urilib/urllib2.py
Log:
Issue1675455: use getaddrinfo for IPv6 support
Added: sandbox/trunk/urilib/TODO
==============================================================================
--- (empty file)
+++ sandbox/trunk/urilib/TODO Tue Sep 25 05:45:53 2007
@@ -0,0 +1,20 @@
+Author: O.R.Senthil Kumaran
+Google Summer of Code 2007 Tasks - Cleanup urllib2
+Date: 25 Sep 2007
+
+TODO:
+
+1) urllib unification progress. Complaince with RFC3986 and RFC3987
+ a) urllib2 merge
+ b) proxy-support
+ b) unit-tests.
+ c) Documentation.
+2) Author PEP to discuss about Unified Module inclusion in Python 2.6 and Python 3K.
+3) [ 1675455 ] Use getaddrinfo() in urllib2.py for IPv6 support.
+ * 25 Sep. Done.
+ * Test with IPv6 address.
+4) As in mechanize and urlgrabber,Implement higher level interfaces to url module,which can accomplish most common tasks.
+ a) Handler classes HTTPRefreshProcessor, HTTPEquivProcessor, HTTPRobotRulesProcessor
+ b) HTTPRedirectHandler, HTTPRequestUpgradeProcessor and ResponseUpgradeProcessor
+5) Patch 1462525 - uriparser.
+6) URL Encoding with respect to Unicode.
Modified: sandbox/trunk/urilib/test_urllib2.py
==============================================================================
--- sandbox/trunk/urilib/test_urllib2.py (original)
+++ sandbox/trunk/urilib/test_urllib2.py Tue Sep 25 05:45:53 2007
@@ -540,6 +540,23 @@
# XXX don't ask me about the mac...
return urlpath
+def gethost_addrinfo(hostname):
+ if socket.has_ipv6:
+ try:
+ for res in socket.getaddrinfo(hostname, None, socket.AF_INET6,
+ socket.SOCK_DGRAM, socket.IPPROTO_IP, socket.AI_CANONNAME):
+ af, socktype, proto, canonname, sa = res
+ except socket.gaierror:
+ for res in socket.getaddrinfo(hostname, None, socket.AF_INET,
+ socket.SOCK_DGRAM, socket.IPPROTO_IP, socket.AI_CANONNAME):
+ af, socktype, proto, canonname, sa = res
+ else:
+ for res in socket.getaddrinfo(hostname, None, socket.AF_INET,
+ socket.SOCK_DGRAM, socket.IPPROTO_IP, socket.AI_CANONNAME):
+ af, socktype, proto, canonname, sa = res
+
+ return sa[0]
+
class HandlerTests(unittest.TestCase):
def test_ftp(self):
@@ -579,7 +596,7 @@
r = h.ftp_open(req)
# ftp authentication not yet implemented by FTPHandler
self.assert_(h.user == h.passwd == "")
- self.assertEqual(h.host, socket.gethostbyname(host))
+ self.assertEqual(h.host, gethost_addrinfo(host))
self.assertEqual(h.port, port)
self.assertEqual(h.dirs, dirs)
self.assertEqual(h.ftpwrapper.filename, filename)
@@ -599,10 +616,10 @@
urls = [
"file://localhost%s" % urlpath,
"file://%s" % urlpath,
- "file://%s%s" % (socket.gethostbyname('localhost'), urlpath),
+ "file://%s%s" % (gethost_addrinfo('localhost'), urlpath),
]
try:
- localaddr = socket.gethostbyname(socket.gethostname())
+ localaddr = gethost_addrinfo(socket.gethostname())
except socket.gaierror:
localaddr = ''
if localaddr:
@@ -635,7 +652,7 @@
for url in [
"file://localhost:80%s" % urlpath,
"file:///file_does_not_exist.txt",
- "file://%s:80%s/%s" % (socket.gethostbyname('localhost'),
+ "file://%s:80%s/%s" % (gethost_addrinfo('localhost'),
os.getcwd(), TESTFN),
"file://somerandomhost.ontheinternet.com%s/%s" %
(os.getcwd(), TESTFN),
Modified: sandbox/trunk/urilib/urllib2.py
==============================================================================
--- sandbox/trunk/urilib/urllib2.py (original)
+++ sandbox/trunk/urilib/urllib2.py Tue Sep 25 05:45:53 2007
@@ -1218,6 +1218,24 @@
return [part.strip() for part in res]
+def gethost_addrinfo(hostname):
+ if socket.has_ipv6:
+ try:
+ for res in socket.getaddrinfo(hostname, None, socket.AF_INET6,
+ socket.SOCK_DGRAM, socket.IPPROTO_IP, socket.AI_CANONNAME):
+ af, socktype, proto, canonname, sa = res
+ except socket.gaierror:
+ for res in socket.getaddrinfo(hostname, None, socket.AF_INET,
+ socket.SOCK_DGRAM, socket.IPPROTO_IP, socket.AI_CANONNAME):
+ af, socktype, proto, canonname, sa = res
+ else:
+ for res in socket.getaddrinfo(hostname, None, socket.AF_INET,
+ socket.SOCK_DGRAM, socket.IPPROTO_IP, socket.AI_CANONNAME):
+ af, socktype, proto, canonname, sa = res
+
+ return sa[0]
+
+
class FileHandler(BaseHandler):
# Use local file or FTP depending on form of URL
def file_open(self, req):
@@ -1233,10 +1251,10 @@
def get_names(self):
if FileHandler.names is None:
try:
- FileHandler.names = (socket.gethostbyname('localhost'),
- socket.gethostbyname(socket.gethostname()))
+ FileHandler.names = (gethost_addrinfo('localhost'),
+ gethost_addrinfo(socket.gethostname()))
except socket.gaierror:
- FileHandler.names = (socket.gethostbyname('localhost'),)
+ FileHandler.names = (gethost_addrinfo('localhost'),)
return FileHandler.names
# not entirely sure what the rules are here
@@ -1257,7 +1275,7 @@
if host:
host, port = splitport(host)
if not host or \
- (not port and socket.gethostbyname(host) in self.get_names()):
+ (not port and gethost_addrinfo(host) in self.get_names()):
return addinfourl(open(localfile, 'rb'),
headers, 'file:'+file)
except OSError, msg:
@@ -1289,7 +1307,7 @@
passwd = unquote(passwd or '')
try:
- host = socket.gethostbyname(host)
+ host = gethost_addrinfo(host)
except socket.error, msg:
raise URLError(msg)
path, attrs = splitattr(req.get_selector())
1
0
Author: andrew.kuchling
Date: Tue Sep 25 02:09:42 2007
New Revision: 58251
Modified:
python/trunk/Doc/whatsnew/2.6.rst
Log:
Add various items
Modified: python/trunk/Doc/whatsnew/2.6.rst
==============================================================================
--- python/trunk/Doc/whatsnew/2.6.rst (original)
+++ python/trunk/Doc/whatsnew/2.6.rst Tue Sep 25 02:09:42 2007
@@ -75,7 +75,23 @@
.. % XXX add general comment about Python 3.0 features in 2.6
-.. % XXX mention -3 switch
+The development cycle for Python 2.6 also saw the release of the first
+alphas of Python 3.0, and the development of 3.0 has influenced
+a number of features in 2.6.
+
+Python 3.0 is a far-ranging redesign of Python that breaks
+compatibility with the 2.x series. This means that existing Python
+code will need a certain amount of conversion in order to run on
+Python 3.0. However, not all the changes in 3.0 necessarily break
+compatibility. In cases where new features won't cause existing code
+to break, they've been backported to 2.6 and are described in this
+document in the appropriate place. Some of the 3.0-derived features
+are:
+
+* A :meth:`__complex__` method for converting objects to a complex number.
+* Alternate syntax for catching exceptions: ``except TypeError as exc``.
+* The addition of :func:`functools.reduce` as a synonym for the built-in
+ :func:`reduce` function.
A new command-line switch, :option:`-3`, enables warnings
about features that will be removed in Python 3.0. You can run code
@@ -406,11 +422,6 @@
Here are all of the changes that Python 2.6 makes to the core Python language.
-* Changes to the :class:`Exception` interface
- as dictated by :pep:`352` continue to be made. For 2.6,
- the :attr:`message` attribute is being deprecated in favor of the
- :attr:`args` attribute.
-
* When calling a function using the ``**`` syntax to provide keyword
arguments, you are no longer required to use a Python dictionary;
any mapping will now work::
@@ -426,8 +437,29 @@
.. % Patch 1686487
+* The built-in types now have improved support for extended slicing syntax,
+ where various combinations of ``(start, stop, step)`` are supplied.
+ Previously, the support was partial and certain corner cases wouldn't work.
+ (Implemented by Thomas Wouters.)
+
+ .. % Revision 57619
+
+* C functions and methods that use
+ :cfunc:`PyComplex_AsCComplex` will now accept arguments that
+ have a :meth:`__complex__` method. In particular, the functions in the
+ :mod:`cmath` module will now accept objects with this method.
+ This is a backport of a Python 3.0 change.
+ (Contributed by Mark Dickinson.)
+
+ .. % Patch #1675423
+
+* Changes to the :class:`Exception` interface
+ as dictated by :pep:`352` continue to be made. For 2.6,
+ the :attr:`message` attribute is being deprecated in favor of the
+ :attr:`args` attribute.
+
* The :func:`compile` built-in function now accepts keyword arguments
- as well as positional parameters. (Contributed by XXX.)
+ as well as positional parameters. (Contributed by Thomas Wouters.)
.. % Patch 1444529
@@ -487,17 +519,32 @@
fieldnames)` is a factory function that creates subclasses of the standard tuple
whose fields are accessible by name as well as index. For example::
- var_type = collections.NamedTuple('variable',
- 'id name type size')
- var = var_type(1, 'frequency', 'int', 4)
-
- print var[0], var.id # Equivalent
- print var[2], var.type # Equivalent
+ >>> var_type = collections.NamedTuple('variable',
+ ... 'id name type size')
+ # Names are separated by spaces or commas.
+ # 'id, name, type, size' would also work.
+ >>> var_type.__fields__
+ ('id', 'name', 'type', 'size')
+
+ >>> var = var_type(1, 'frequency', 'int', 4)
+ >>> print var[0], var.id # Equivalent
+ 1 1
+ >>> print var[2], var.type # Equivalent
+ int int
+ >>> v2 = var.__replace__('name', 'amplitude')
+ >>> v2
+ variable(id=1, name='amplitude', type='int', size=4)
(Contributed by Raymond Hettinger.)
+* The :mod:`ctypes` module now supports a :class:`c_bool` datatype
+ that represents the C99 ``bool`` type. (Contributed by David Remahl.)
+
+ .. % Patch 1649190
+
* A new method in the :mod:`curses` module: for a window, :meth:`chgat` changes
- the display characters for a certain number of characters on a single line. ::
+ the display characters for a certain number of characters on a single line.
+ ::
# Boldface text starting at y=0,x=21
# and affecting the rest of the line.
@@ -505,11 +552,33 @@
(Contributed by Fabian Kreutz.)
+* The :mod:`decimal` module was updated to version 1.66 of
+ `the General Decimal Specification <http://www2.hursley.ibm.com/decimal/decarith.html>`__. New features
+ include some methods for some basic mathematical functions such as
+ :meth:`exp` and :meth:`log10`::
+
+ >>> Decimal(1).exp()
+ Decimal("2.718281828459045235360287471")
+ >>> Decimal("2.7182818").ln()
+ Decimal("0.9999999895305022877376682436")
+ >>> Decimal(1000).log10()
+ Decimal("3")
+
+ (Implemented by Facundo Batista and Mark Dickinson.)
+
* An optional ``timeout`` parameter was added to the
:class:`ftplib.FTP` class constructor as well as the :meth:`connect`
method, specifying a timeout measured in seconds. (Added by Facundo
Batista.)
+* The :func:`reduce` built-in function is also available in the
+ :mod:`functools` module. In Python 3.0, the built-in is dropped and it's
+ only available from :mod:`functools`; currently there are no plans
+ to drop the built-in in the 2.x series. (Patched by
+ Christian Heimes.)
+
+ .. % Patch 1739906
+
* The :func:`glob.glob` function can now return Unicode filenames if
a Unicode path was used and Unicode filenames are matched within the directory.
@@ -548,7 +617,7 @@
.. % Patch #1490190
-* The :func:`os.walk` function now has a "followlinks" parameter. If
+* The :func:`os.walk` function now has a ``followlinks`` parameter. If
set to True, it will follow symlinks pointing to directories and
visit the directory's contents. For backward compatibility, the
parameter's default value is false. Note that the function can fall
@@ -574,10 +643,17 @@
On Windows, :func:`os.path.expandvars` will now expand environment variables
in the form "%var%", and "~user" will be expanded into the
- user's home directory path. (Contributed by XXX.)
+ user's home directory path. (Contributed by Josiah Carlson.)
.. % Patch 957650
+* The Python debugger provided by the :mod:`pdb` module
+ gained a new command: "run" restarts the Python program being debugged,
+ and can optionally take new command-line arguments for the program.
+ (Contributed by Rocky Bernstein.)
+
+ .. % Patch #1393667
+
* New functions in the :mod:`posix` module: :func:`chflags` and :func:`lchflags`
are wrappers for the corresponding system calls (where they're available).
Constants for the flag values are defined in the :mod:`stat` module; some
@@ -701,6 +777,17 @@
(Added by Facundo Batista.)
+* The XML-RPC classes :class:`SimpleXMLRPCServer` and :class:`DocXMLRPCServer`
+ classes can now be preventing from immediately opening and binding to
+ their socket by passing True as the ``bind_and_activate``
+ constructor parameter. This can be used to modify the instance's
+ :attr:`allow_reuse_address` attribute before calling the
+ :meth:`server_bind` and :meth:`server_activate` methods to
+ open the socket and begin listening for connections.
+ (Contributed by Peter Parente.)
+
+ .. % Patch 1599845
+
.. % ======================================================================
.. % whole new modules get described in \subsections here
@@ -712,7 +799,7 @@
Changes to Python's build process and to the C API include:
-* Detailed changes are listed here.
+* Detailed changes will be listed here.
.. % ======================================================================
@@ -737,7 +824,7 @@
Some of the more notable changes are:
-* Details go here.
+* Details will go here.
.. % ======================================================================
1
0
Author: andrew.kuchling
Date: Tue Sep 25 01:46:28 2007
New Revision: 58250
Modified:
python/trunk/Doc/library/decimal.rst
Log:
Typo fix
Modified: python/trunk/Doc/library/decimal.rst
==============================================================================
--- python/trunk/Doc/library/decimal.rst (original)
+++ python/trunk/Doc/library/decimal.rst Tue Sep 25 01:46:28 2007
@@ -179,7 +179,7 @@
>>> c % a
Decimal("0.77")
-And some mathematic functions are also available to Decimal::
+And some mathematical functions are also available to Decimal::
>>> Decimal(2).sqrt()
Decimal("1.414213562373095048801688724")
1
0
Author: andrew.kuchling
Date: Tue Sep 25 01:45:51 2007
New Revision: 58249
Modified:
python/trunk/Doc/library/pdb.rst
Log:
Remove stray odd character; grammar fix
Modified: python/trunk/Doc/library/pdb.rst
==============================================================================
--- python/trunk/Doc/library/pdb.rst (original)
+++ python/trunk/Doc/library/pdb.rst Tue Sep 25 01:45:51 2007
@@ -243,7 +243,7 @@
Specifying any command resuming execution (currently continue, step, next,
return, jump, quit and their abbreviations) terminates the command list (as if
that command was immediately followed by end). This is because any time you
- resume execution (even with a simple next or step), you may encounter· another
+ resume execution (even with a simple next or step), you may encounter another
breakpoint--which could have its own command list, leading to ambiguities about
which list to execute.
@@ -334,7 +334,7 @@
(Pdb)
run [*args* ...]
- Restart the debugged python program. If an argument is supplied, it is splitted
+ Restart the debugged python program. If an argument is supplied, it is split
with "shlex" and the result is used as the new sys.argv. History, breakpoints,
actions and debugger options are preserved. "restart" is an alias for "run".
1
0
Sept. 24, 2007
Author: paul.dubois
Date: Mon Sep 24 20:15:28 2007
New Revision: 58248
Added:
tracker/instances/python-dev/detectors/audit2to3.py
Log:
Add an auditor to assign 2to3 issues to Collin Winter.
Added: tracker/instances/python-dev/detectors/audit2to3.py
==============================================================================
--- (empty file)
+++ tracker/instances/python-dev/detectors/audit2to3.py Mon Sep 24 20:15:28 2007
@@ -0,0 +1,40 @@
+import roundup
+import roundup.instance
+import sets
+
+def update2to3(db, cl, nodeid, newvalues):
+ '''Component 2to3 issues to be assigned to collinwinter unless otherwise
+ assigned.
+ '''
+ # nodeid will be None if this is a new node
+ if nodeid is not None:
+ componentIDS = cl.get(nodeid, 'components')
+ if newvalues.has_key('components'):
+ componentIDS = newvalues['components']
+ if componentIDS and (theComponent in componentIDS):
+ if not newvalues.has_key('assignee') or \
+ newvalues['assignee'] == Nobody:
+ newvalues['assignee'] = theMan
+
+def init(db):
+ global theMan, theComponent, Nobody
+ theMan = db.user.lookup('collinwinter')
+ Nobody = db.user.lookup('nobody')
+ theComponent = db.component.lookup('2to3 (2.x to 3.0 conversion tool)')
+
+ db.issue.audit('create', update2to3)
+ db.issue.audit('set', update2to3)
+
+if __name__ == '__main__':
+ global theMan, theComponent, Nobody
+ instanceHome='/home/roundup/trackers/tracker'
+ instance = roundup.instance.open(instanceHome)
+ db = instance.open('admin')
+ cl = db.issue
+ nodeID = '1002'
+ theMan = db.user.lookup('collinwinter')
+ Nobody = db.user.lookup('nobody')
+ theComponent = db.component.lookup('2to3 (2.x to 3.0 conversion tool)')
+ newvalues = { 'components': [theComponent] , 'assignee': Nobody}
+ update2to3(db, cl, nodeID, newvalues)
+ print Nobody, theMan, theComponent, newvalues
1
0