The Buildbot has detected a new failure of ARM Linux 2.5. Full details are available at: http://www.python.org/dev/buildbot/all/ARM%20Linux%202.5/builds/0 Buildbot URL: http://www.python.org/dev/buildbot/all/ Buildslave for this Build: klose-linux-arm Build Reason: Build Source Stamp: [branch branches/release25-maint] HEAD Blamelist: fred.drake,neal.norwitz BUILD FAILED: failed test Excerpt from the test logfile: Traceback (most recent call last): File "/home/pybot/buildarea-arm/2.5.klose-linux-arm/build/Lib/threading.py", line 460, in __bootstrap self.run() File "/home/pybot/buildarea-arm/2.5.klose-linux-arm/build/Lib/test/test_socketserver.py", line 81, in run svr = svrcls(self.__addr, self.__hdlrcls) File "/home/pybot/buildarea-arm/2.5.klose-linux-arm/build/Lib/SocketServer.py", line 330, in __init__ self.server_bind() File "/home/pybot/buildarea-arm/2.5.klose-linux-arm/build/Lib/test/test_socketserver.py", line 159, in server_bind TCPServer.server_bind(self) File "/home/pybot/buildarea-arm/2.5.klose-linux-arm/build/Lib/SocketServer.py", line 341, in server_bind self.socket.bind(self.server_address) File "<string>", line 1, in bind gaierror: (-2, 'Name or service not known') Traceback (most recent call last): File "/home/pybot/buildarea-arm/2.5.klose-linux-arm/build/Lib/threading.py", line 460, in __bootstrap self.run() File "/home/pybot/buildarea-arm/2.5.klose-linux-arm/build/Lib/threading.py", line 440, in run self.__target(*self.__args, **self.__kwargs) File "/home/pybot/buildarea-arm/2.5.klose-linux-arm/build/Lib/test/test_socket_ssl.py", line 104, in listener s.accept() File "/home/pybot/buildarea-arm/2.5.klose-linux-arm/build/Lib/socket.py", line 167, in accept sock, addr = self._sock.accept() error: (4, 'Interrupted system call') make: *** [buildbottest] Aborted sincerely, -The Buildbot
participants (1)
-
buildbot@python.org