Re: [yt-users] Yt not installing right
[install_log trimmed] So, it seem to me that it is in fact a semi-known issue, where numpy is using g77 to link and install. Unfortunately, it doesn't seem to correctly use the "-shared" option. This shows up in the lapack compilation & linkage step, which is where the install fails. We can try a couple things here, but unfortunately it might be a little bit experimental. I will be using the environment variables you have set in the install_script.sh here for convenience; you'll need to insert the correct value of DEST_DIR. A lead $ means that command should be typed in at the prompt. ## First off, try installing gfortran, if it is not already installed. $ sudo apt-get install gfortran Then, if that succeeds: $ cd $DEST_DIR/src/numpy-1.2.1 $ rm -rf build dist $ $DEST_DIR/bin/python2.6 setup.py build_ext --fcompiler=gfortran $ $DEST_DIR/bin/python2.6 setup.py install If this works, and it might not, $ touch done and then re-run the install script. This should pass over most of the installation and continue on where it left off. The second option, which I think is less likely to work: ## $ cd $DEST_DIR/src/numpy-1.2.1/ $ $DEST_DIR/bin/python2.6 setup.py config_fc --f77flags="-shared" built_ext $ $DEST_DIR/bin/python2.6 setup.py install and if that works, $ touch done and then, again, re-run the install_script.sh. Let me know how those two options go; hopefully we can figure this out. If not, I have another idea that I'm a bit reluctant to suggest, which is to have you "$DEST_DIR/bin/easy_install scons numscons" and then run "$DEST_DIR/bin/python2.6 setup.py scons install" from the numpy directory. David Cournapeau has done some amazing work with scons, and it seems like it will ultimately be the build system for NumPy (and it's pretty great) but I am hesitant because it requires two additional dependencies right now. Let me know how it goes, -Matt On Thu, Jan 22, 2009 at 2:33 PM, rsoares <dlleuz@xmission.com> wrote:
Hi Matt,
I have GNU Fortran (GCC) 4.2.4 on Ubuntu and here is the full installation log. I can use Intel fortran compiler if you think it would help.
Matthew Turk wrote:
Hi!
Sorry to hear you're having problems, but it's good to hear that you're trying out the newest version, from the trunk. :) I have a suspicion I know what's going on, but it would help out if you could send (even off-list, if you'd rather) the rest of the installation log. What I believe is happening is that the numpy distutils are using the wrong fortran compiler to compile and link the fortran interface libraries. This is a problem I ran into a while back, but my solution was probably not very portable.
If we can figure out which fortran compiler you're using, we might be able to make some progress. Are you running on Debian? Can you tell me if you have any of g95, gfortran or g77 installed?
Thanks!
-Matt
On Thu, Jan 22, 2009 at 1:00 PM, rsoares <dlleuz@xmission.com> wrote:
It is gfortran. Also I've tried installing numpy-1.2.1 myself since I notice my version of python is 2.5 and attached the (succesful ?) install log from that. The old yt used python 2.5 but the new one is 2.6. I had to install python-dev however to get my numpy to install. Matthew Turk wrote:
[install_log trimmed]
So, it seem to me that it is in fact a semi-known issue, where numpy is using g77 to link and install. Unfortunately, it doesn't seem to correctly use the "-shared" option. This shows up in the lapack compilation & linkage step, which is where the install fails.
We can try a couple things here, but unfortunately it might be a little bit experimental. I will be using the environment variables you have set in the install_script.sh here for convenience; you'll need to insert the correct value of DEST_DIR. A lead $ means that command should be typed in at the prompt.
##
First off, try installing gfortran, if it is not already installed.
$ sudo apt-get install gfortran
Then, if that succeeds:
$ cd $DEST_DIR/src/numpy-1.2.1 $ rm -rf build dist $ $DEST_DIR/bin/python2.6 setup.py build_ext --fcompiler=gfortran $ $DEST_DIR/bin/python2.6 setup.py install
If this works, and it might not,
$ touch done
and then re-run the install script. This should pass over most of the installation and continue on where it left off.
The second option, which I think is less likely to work:
##
$ cd $DEST_DIR/src/numpy-1.2.1/ $ $DEST_DIR/bin/python2.6 setup.py config_fc --f77flags="-shared" built_ext $ $DEST_DIR/bin/python2.6 setup.py install
and if that works,
$ touch done
and then, again, re-run the install_script.sh.
Let me know how those two options go; hopefully we can figure this out. If not, I have another idea that I'm a bit reluctant to suggest, which is to have you "$DEST_DIR/bin/easy_install scons numscons" and then run "$DEST_DIR/bin/python2.6 setup.py scons install" from the numpy directory. David Cournapeau has done some amazing work with scons, and it seems like it will ultimately be the build system for NumPy (and it's pretty great) but I am hesitant because it requires two additional dependencies right now.
Let me know how it goes,
-Matt
On Thu, Jan 22, 2009 at 2:33 PM, rsoares <dlleuz@xmission.com> wrote:
Hi Matt,
I have GNU Fortran (GCC) 4.2.4 on Ubuntu and here is the full installation log. I can use Intel fortran compiler if you think it would help.
Matthew Turk wrote:
Hi!
Sorry to hear you're having problems, but it's good to hear that you're trying out the newest version, from the trunk. :) I have a suspicion I know what's going on, but it would help out if you could send (even off-list, if you'd rather) the rest of the installation log. What I believe is happening is that the numpy distutils are using the wrong fortran compiler to compile and link the fortran interface libraries. This is a problem I ran into a while back, but my solution was probably not very portable.
If we can figure out which fortran compiler you're using, we might be able to make some progress. Are you running on Debian? Can you tell me if you have any of g95, gfortran or g77 installed?
Thanks!
-Matt
On Thu, Jan 22, 2009 at 1:00 PM, rsoares <dlleuz@xmission.com> wrote:
yt-users mailing list yt-users@lists.spacepope.org http://lists.spacepope.org/listinfo.cgi/yt-users-spacepope.org
Running from numpy source directory. non-existing path in 'numpy/distutils': 'site.cfg' F2PY Version 2_5972 blas_opt_info: blas_mkl_info: libraries mkl,vml,guide not found in /usr/local/lib libraries mkl,vml,guide not found in /usr/lib NOT AVAILABLE atlas_blas_threads_info: Setting PTATLAS=ATLAS libraries ptf77blas,ptcblas,atlas not found in /usr/local/lib libraries ptf77blas,ptcblas,atlas not found in /usr/lib NOT AVAILABLE atlas_blas_info: libraries f77blas,cblas,atlas not found in /usr/local/lib libraries f77blas,cblas,atlas not found in /usr/lib NOT AVAILABLE /home/robyn/numpy-1.2.1/numpy/distutils/system_info.py:1340: UserWarning: Atlas (http://math-atlas.sourceforge.net/) libraries not found. Directories to search for the libraries can be specified in the numpy/distutils/site.cfg file (section [atlas]) or by setting the ATLAS environment variable. warnings.warn(AtlasNotFoundError.__doc__) blas_info: libraries blas not found in /usr/local/lib FOUND: libraries = ['blas'] library_dirs = ['/usr/lib'] language = f77 FOUND: libraries = ['blas'] library_dirs = ['/usr/lib'] define_macros = [('NO_ATLAS_INFO', 1)] language = f77 lapack_opt_info: lapack_mkl_info: mkl_info: libraries mkl,vml,guide not found in /usr/local/lib libraries mkl,vml,guide not found in /usr/lib NOT AVAILABLE NOT AVAILABLE atlas_threads_info: Setting PTATLAS=ATLAS libraries ptf77blas,ptcblas,atlas not found in /usr/local/lib libraries lapack_atlas not found in /usr/local/lib libraries ptf77blas,ptcblas,atlas not found in /usr/lib libraries lapack_atlas not found in /usr/lib numpy.distutils.system_info.atlas_threads_info NOT AVAILABLE atlas_info: libraries f77blas,cblas,atlas not found in /usr/local/lib libraries lapack_atlas not found in /usr/local/lib libraries f77blas,cblas,atlas not found in /usr/lib libraries lapack_atlas not found in /usr/lib numpy.distutils.system_info.atlas_info NOT AVAILABLE /home/robyn/numpy-1.2.1/numpy/distutils/system_info.py:1247: UserWarning: Atlas (http://math-atlas.sourceforge.net/) libraries not found. Directories to search for the libraries can be specified in the numpy/distutils/site.cfg file (section [atlas]) or by setting the ATLAS environment variable. warnings.warn(AtlasNotFoundError.__doc__) lapack_info: libraries lapack not found in /usr/local/lib FOUND: libraries = ['lapack'] library_dirs = ['/usr/lib'] language = f77 FOUND: libraries = ['lapack', 'blas'] library_dirs = ['/usr/lib'] define_macros = [('NO_ATLAS_INFO', 1)] language = f77 running install running build running config_cc unifing config_cc, config, build_clib, build_ext, build commands --compiler options running config_fc unifing config_fc, config, build_clib, build_ext, build commands --fcompiler options running build_src building py_modules sources building extension "numpy.core.multiarray" sources Generating build/src.linux-i686-2.5/numpy/core/include/numpy/config.h customize GnuFCompiler Found executable /usr/bin/g77 gnu: no Fortran 90 compiler found gnu: no Fortran 90 compiler found customize GnuFCompiler gnu: no Fortran 90 compiler found gnu: no Fortran 90 compiler found customize GnuFCompiler using config C compiler: gcc -pthread -fno-strict-aliasing -DNDEBUG -g -fwrapv -O2 -Wall -Wstrict-prototypes -fPIC compile options: '-I/usr/include/python2.5 -Inumpy/core/src -Inumpy/core/include -I/usr/include/python2.5 -c' gcc: _configtest.c gcc -pthread _configtest.o -L/usr/local/lib -o _configtest _configtest success! removing: _configtest.c _configtest.o _configtest C compiler: gcc -pthread -fno-strict-aliasing -DNDEBUG -g -fwrapv -O2 -Wall -Wstrict-prototypes -fPIC compile options: '-Inumpy/core/src -Inumpy/core/include -I/usr/include/python2.5 -c' gcc: _configtest.c gcc -pthread _configtest.o -o _configtest _configtest.o: In function `main': /home/robyn/numpy-1.2.1/_configtest.c:5: undefined reference to `exp' collect2: ld returned 1 exit status _configtest.o: In function `main': /home/robyn/numpy-1.2.1/_configtest.c:5: undefined reference to `exp' collect2: ld returned 1 exit status failure. removing: _configtest.c _configtest.o C compiler: gcc -pthread -fno-strict-aliasing -DNDEBUG -g -fwrapv -O2 -Wall -Wstrict-prototypes -fPIC compile options: '-Inumpy/core/src -Inumpy/core/include -I/usr/include/python2.5 -c' gcc: _configtest.c gcc -pthread _configtest.o -lm -o _configtest _configtest success! removing: _configtest.c _configtest.o _configtest C compiler: gcc -pthread -fno-strict-aliasing -DNDEBUG -g -fwrapv -O2 -Wall -Wstrict-prototypes -fPIC compile options: '-Inumpy/core/src -Inumpy/core/include -I/usr/include/python2.5 -c' gcc: _configtest.c _configtest.c: In function ‘main’: _configtest.c:4: warning: statement with no effect gcc -pthread _configtest.o -lm -o _configtest success! removing: _configtest.c _configtest.o _configtest C compiler: gcc -pthread -fno-strict-aliasing -DNDEBUG -g -fwrapv -O2 -Wall -Wstrict-prototypes -fPIC compile options: '-Inumpy/core/src -Inumpy/core/include -I/usr/include/python2.5 -c' gcc: _configtest.c _configtest.c: In function ‘main’: _configtest.c:4: warning: statement with no effect gcc -pthread _configtest.o -lm -o _configtest success! removing: _configtest.c _configtest.o _configtest C compiler: gcc -pthread -fno-strict-aliasing -DNDEBUG -g -fwrapv -O2 -Wall -Wstrict-prototypes -fPIC compile options: '-Inumpy/core/src -Inumpy/core/include -I/usr/include/python2.5 -c' gcc: _configtest.c _configtest.c: In function ‘main’: _configtest.c:4: warning: statement with no effect gcc -pthread _configtest.o -lm -o _configtest success! removing: _configtest.c _configtest.o _configtest C compiler: gcc -pthread -fno-strict-aliasing -DNDEBUG -g -fwrapv -O2 -Wall -Wstrict-prototypes -fPIC compile options: '-Inumpy/core/src -Inumpy/core/include -I/usr/include/python2.5 -c' gcc: _configtest.c _configtest.c: In function ‘main’: _configtest.c:4: warning: statement with no effect gcc -pthread _configtest.o -lm -o _configtest success! removing: _configtest.c _configtest.o _configtest C compiler: gcc -pthread -fno-strict-aliasing -DNDEBUG -g -fwrapv -O2 -Wall -Wstrict-prototypes -fPIC compile options: '-Inumpy/core/src -Inumpy/core/include -I/usr/include/python2.5 -c' gcc: _configtest.c _configtest.c: In function ‘main’: _configtest.c:4: warning: statement with no effect gcc -pthread _configtest.o -lm -o _configtest success! removing: _configtest.c _configtest.o _configtest C compiler: gcc -pthread -fno-strict-aliasing -DNDEBUG -g -fwrapv -O2 -Wall -Wstrict-prototypes -fPIC compile options: '-Inumpy/core/src -Inumpy/core/include -I/usr/include/python2.5 -c' gcc: _configtest.c _configtest.c: In function ‘main’: _configtest.c:4: warning: statement with no effect gcc -pthread _configtest.o -lm -o _configtest success! removing: _configtest.c _configtest.o _configtest C compiler: gcc -pthread -fno-strict-aliasing -DNDEBUG -g -fwrapv -O2 -Wall -Wstrict-prototypes -fPIC compile options: '-Inumpy/core/src -Inumpy/core/include -I/usr/include/python2.5 -c' gcc: _configtest.c _configtest.c: In function ‘main’: _configtest.c:4: warning: statement with no effect gcc -pthread _configtest.o -lm -o _configtest success! removing: _configtest.c _configtest.o _configtest C compiler: gcc -pthread -fno-strict-aliasing -DNDEBUG -g -fwrapv -O2 -Wall -Wstrict-prototypes -fPIC compile options: '-Inumpy/core/src -Inumpy/core/include -I/usr/include/python2.5 -c' gcc: _configtest.c _configtest.c: In function ‘main’: _configtest.c:4: warning: statement with no effect gcc -pthread _configtest.o -lm -o _configtest success! removing: _configtest.c _configtest.o _configtest C compiler: gcc -pthread -fno-strict-aliasing -DNDEBUG -g -fwrapv -O2 -Wall -Wstrict-prototypes -fPIC compile options: '-Inumpy/core/src -Inumpy/core/include -I/usr/include/python2.5 -c' gcc: _configtest.c _configtest.c: In function ‘main’: _configtest.c:4: warning: statement with no effect gcc -pthread _configtest.o -lm -o _configtest success! removing: _configtest.c _configtest.o _configtest C compiler: gcc -pthread -fno-strict-aliasing -DNDEBUG -g -fwrapv -O2 -Wall -Wstrict-prototypes -fPIC compile options: '-Inumpy/core/src -Inumpy/core/include -I/usr/include/python2.5 -c' gcc: _configtest.c _configtest.c: In function ‘main’: _configtest.c:4: warning: statement with no effect gcc -pthread _configtest.o -lm -o _configtest success! removing: _configtest.c _configtest.o _configtest C compiler: gcc -pthread -fno-strict-aliasing -DNDEBUG -g -fwrapv -O2 -Wall -Wstrict-prototypes -fPIC compile options: '-Inumpy/core/src -Inumpy/core/include -I/usr/include/python2.5 -c' gcc: _configtest.c _configtest.c: In function ‘main’: _configtest.c:4: error: ‘trunc’ undeclared (first use in this function) _configtest.c:4: error: (Each undeclared identifier is reported only once _configtest.c:4: error: for each function it appears in.) _configtest.c: In function ‘main’: _configtest.c:4: error: ‘trunc’ undeclared (first use in this function) _configtest.c:4: error: (Each undeclared identifier is reported only once _configtest.c:4: error: for each function it appears in.) failure. removing: _configtest.c _configtest.o File: build/src.linux-i686-2.5/numpy/core/include/numpy/config.h /* #define SIZEOF_SHORT 2 */ /* #define SIZEOF_INT 4 */ /* #define SIZEOF_LONG 4 */ /* #define SIZEOF_FLOAT 4 */ /* #define SIZEOF_DOUBLE 8 */ #define SIZEOF_LONG_DOUBLE 12 #define SIZEOF_PY_INTPTR_T 4 /* #define SIZEOF_LONG_LONG 8 */ #define SIZEOF_PY_LONG_LONG 8 /* #define CHAR_BIT 8 */ #define MATHLIB m #define HAVE_LONGDOUBLE_FUNCS #define HAVE_FLOAT_FUNCS #define HAVE_LOG1P #define HAVE_EXPM1 #define HAVE_INVERSE_HYPERBOLIC #define HAVE_INVERSE_HYPERBOLIC_FLOAT #define HAVE_INVERSE_HYPERBOLIC_LONGDOUBLE #define HAVE_ISNAN #define HAVE_ISINF #define HAVE_RINT EOF adding 'build/src.linux-i686-2.5/numpy/core/include/numpy/config.h' to sources. Generating build/src.linux-i686-2.5/numpy/core/include/numpy/numpyconfig.h C compiler: gcc -pthread -fno-strict-aliasing -DNDEBUG -g -fwrapv -O2 -Wall -Wstrict-prototypes -fPIC compile options: '-I/usr/include/python2.5 -Inumpy/core/include -Ibuild/src.linux-i686-2.5/numpy/core/include/numpy -Inumpy/core/src -Inumpy/core/include -I/usr/include/python2.5 -c' gcc: _configtest.c _configtest.c:6: warning: function declaration isn’t a prototype gcc -pthread _configtest.o -L/usr/local/lib -o _configtest _configtest success! removing: _configtest.c _configtest.o _configtest C compiler: gcc -pthread -fno-strict-aliasing -DNDEBUG -g -fwrapv -O2 -Wall -Wstrict-prototypes -fPIC compile options: '-Inumpy/core/src -Inumpy/core/include -I/usr/include/python2.5 -c' gcc: _configtest.c _configtest.c:5: warning: function declaration isn’t a prototype success! removing: _configtest.c _configtest.o File: build/src.linux-i686-2.5/numpy/core/include/numpy/numpyconfig.h /* * This file is generated by numpy/core/setup.pyc. DO NOT EDIT */ #define NPY_SIZEOF_SHORT 2 #define NPY_SIZEOF_INT 4 #define NPY_SIZEOF_LONG 4 #define NPY_SIZEOF_FLOAT 4 #define NPY_SIZEOF_DOUBLE 8 #define NPY_SIZEOF_LONGDOUBLE 12 #define NPY_SIZEOF_PY_INTPTR_T 4 #define NPY_NO_SMP 0 #define NPY_SIZEOF_LONGLONG 8 #define NPY_SIZEOF_PY_LONG_LONG 8 /* #define CHAR_BIT 8 */ #define NPY_USE_C99_FORMATS 1 #ifndef __STDC_FORMAT_MACROS #define __STDC_FORMAT_MACROS 1 #endif EOF adding 'build/src.linux-i686-2.5/numpy/core/include/numpy/numpyconfig.h' to sources. executing numpy/core/code_generators/generate_numpy_api.py adding 'build/src.linux-i686-2.5/numpy/core/include/numpy/__multiarray_api.h' to sources. creating build/src.linux-i686-2.5/numpy/core/src conv_template:> build/src.linux-i686-2.5/numpy/core/src/scalartypes.inc adding 'build/src.linux-i686-2.5/numpy/core/src' to include_dirs. conv_template:> build/src.linux-i686-2.5/numpy/core/src/arraytypes.inc numpy.core - nothing done with h_files = ['build/src.linux-i686-2.5/numpy/core/src/scalartypes.inc', 'build/src.linux-i686-2.5/numpy/core/src/arraytypes.inc', 'build/src.linux-i686-2.5/numpy/core/include/numpy/config.h', 'build/src.linux-i686-2.5/numpy/core/include/numpy/numpyconfig.h', 'build/src.linux-i686-2.5/numpy/core/include/numpy/__multiarray_api.h'] building extension "numpy.core.umath" sources adding 'build/src.linux-i686-2.5/numpy/core/include/numpy/config.h' to sources. adding 'build/src.linux-i686-2.5/numpy/core/include/numpy/numpyconfig.h' to sources. executing numpy/core/code_generators/generate_ufunc_api.py adding 'build/src.linux-i686-2.5/numpy/core/include/numpy/__ufunc_api.h' to sources. conv_template:> build/src.linux-i686-2.5/numpy/core/src/umathmodule.c adding 'build/src.linux-i686-2.5/numpy/core/src' to include_dirs. numpy.core - nothing done with h_files = ['build/src.linux-i686-2.5/numpy/core/src/scalartypes.inc', 'build/src.linux-i686-2.5/numpy/core/src/arraytypes.inc', 'build/src.linux-i686-2.5/numpy/core/include/numpy/config.h', 'build/src.linux-i686-2.5/numpy/core/include/numpy/numpyconfig.h', 'build/src.linux-i686-2.5/numpy/core/include/numpy/__ufunc_api.h'] building extension "numpy.core._sort" sources adding 'build/src.linux-i686-2.5/numpy/core/include/numpy/config.h' to sources. adding 'build/src.linux-i686-2.5/numpy/core/include/numpy/numpyconfig.h' to sources. executing numpy/core/code_generators/generate_numpy_api.py adding 'build/src.linux-i686-2.5/numpy/core/include/numpy/__multiarray_api.h' to sources. conv_template:> build/src.linux-i686-2.5/numpy/core/src/_sortmodule.c numpy.core - nothing done with h_files = ['build/src.linux-i686-2.5/numpy/core/include/numpy/config.h', 'build/src.linux-i686-2.5/numpy/core/include/numpy/numpyconfig.h', 'build/src.linux-i686-2.5/numpy/core/include/numpy/__multiarray_api.h'] building extension "numpy.core.scalarmath" sources adding 'build/src.linux-i686-2.5/numpy/core/include/numpy/config.h' to sources. adding 'build/src.linux-i686-2.5/numpy/core/include/numpy/numpyconfig.h' to sources. executing numpy/core/code_generators/generate_numpy_api.py adding 'build/src.linux-i686-2.5/numpy/core/include/numpy/__multiarray_api.h' to sources. executing numpy/core/code_generators/generate_ufunc_api.py adding 'build/src.linux-i686-2.5/numpy/core/include/numpy/__ufunc_api.h' to sources. conv_template:> build/src.linux-i686-2.5/numpy/core/src/scalarmathmodule.c numpy.core - nothing done with h_files = ['build/src.linux-i686-2.5/numpy/core/include/numpy/config.h', 'build/src.linux-i686-2.5/numpy/core/include/numpy/numpyconfig.h', 'build/src.linux-i686-2.5/numpy/core/include/numpy/__multiarray_api.h', 'build/src.linux-i686-2.5/numpy/core/include/numpy/__ufunc_api.h'] building extension "numpy.core._dotblas" sources building extension "numpy.lib._compiled_base" sources building extension "numpy.numarray._capi" sources building extension "numpy.fft.fftpack_lite" sources building extension "numpy.linalg.lapack_lite" sources creating build/src.linux-i686-2.5/numpy/linalg adding 'numpy/linalg/lapack_litemodule.c' to sources. adding 'numpy/linalg/python_xerbla.c' to sources. building extension "numpy.random.mtrand" sources creating build/src.linux-i686-2.5/numpy/random C compiler: gcc -pthread -fno-strict-aliasing -DNDEBUG -g -fwrapv -O2 -Wall -Wstrict-prototypes -fPIC compile options: '-Inumpy/core/src -Inumpy/core/include -I/usr/include/python2.5 -c' gcc: _configtest.c gcc -pthread _configtest.o -o _configtest _configtest failure. removing: _configtest.c _configtest.o _configtest building data_files sources running build_py creating build/lib.linux-i686-2.5 creating build/lib.linux-i686-2.5/numpy copying numpy/version.py -> build/lib.linux-i686-2.5/numpy copying numpy/ctypeslib.py -> build/lib.linux-i686-2.5/numpy copying numpy/setup.py -> build/lib.linux-i686-2.5/numpy copying numpy/__init__.py -> build/lib.linux-i686-2.5/numpy copying numpy/dual.py -> build/lib.linux-i686-2.5/numpy copying numpy/matlib.py -> build/lib.linux-i686-2.5/numpy copying numpy/_import_tools.py -> build/lib.linux-i686-2.5/numpy copying numpy/setupscons.py -> build/lib.linux-i686-2.5/numpy copying numpy/add_newdocs.py -> build/lib.linux-i686-2.5/numpy copying build/src.linux-i686-2.5/numpy/__config__.py -> build/lib.linux-i686-2.5/numpy creating build/lib.linux-i686-2.5/numpy/distutils copying numpy/distutils/misc_util.py -> build/lib.linux-i686-2.5/numpy/distutils copying numpy/distutils/conv_template.py -> build/lib.linux-i686-2.5/numpy/distutils copying numpy/distutils/setup.py -> build/lib.linux-i686-2.5/numpy/distutils copying numpy/distutils/log.py -> build/lib.linux-i686-2.5/numpy/distutils copying numpy/distutils/intelccompiler.py -> build/lib.linux-i686-2.5/numpy/distutils copying numpy/distutils/__init__.py -> build/lib.linux-i686-2.5/numpy/distutils copying numpy/distutils/lib2def.py -> build/lib.linux-i686-2.5/numpy/distutils copying numpy/distutils/__version__.py -> build/lib.linux-i686-2.5/numpy/distutils copying numpy/distutils/from_template.py -> build/lib.linux-i686-2.5/numpy/distutils copying numpy/distutils/exec_command.py -> build/lib.linux-i686-2.5/numpy/distutils copying numpy/distutils/core.py -> build/lib.linux-i686-2.5/numpy/distutils copying numpy/distutils/interactive.py -> build/lib.linux-i686-2.5/numpy/distutils copying numpy/distutils/mingw32ccompiler.py -> build/lib.linux-i686-2.5/numpy/distutils copying numpy/distutils/numpy_distribution.py -> build/lib.linux-i686-2.5/numpy/distutils copying numpy/distutils/line_endings.py -> build/lib.linux-i686-2.5/numpy/distutils copying numpy/distutils/info.py -> build/lib.linux-i686-2.5/numpy/distutils copying numpy/distutils/ccompiler.py -> build/lib.linux-i686-2.5/numpy/distutils copying numpy/distutils/setupscons.py -> build/lib.linux-i686-2.5/numpy/distutils copying numpy/distutils/cpuinfo.py -> build/lib.linux-i686-2.5/numpy/distutils copying numpy/distutils/unixccompiler.py -> build/lib.linux-i686-2.5/numpy/distutils copying numpy/distutils/extension.py -> build/lib.linux-i686-2.5/numpy/distutils copying numpy/distutils/system_info.py -> build/lib.linux-i686-2.5/numpy/distutils copying numpy/distutils/environment.py -> build/lib.linux-i686-2.5/numpy/distutils copying build/src.linux-i686-2.5/numpy/distutils/__config__.py -> build/lib.linux-i686-2.5/numpy/distutils creating build/lib.linux-i686-2.5/numpy/distutils/command copying numpy/distutils/command/egg_info.py -> build/lib.linux-i686-2.5/numpy/distutils/command copying numpy/distutils/command/install.py -> build/lib.linux-i686-2.5/numpy/distutils/command copying numpy/distutils/command/__init__.py -> build/lib.linux-i686-2.5/numpy/distutils/command copying numpy/distutils/command/config_compiler.py -> build/lib.linux-i686-2.5/numpy/distutils/command copying numpy/distutils/command/build.py -> build/lib.linux-i686-2.5/numpy/distutils/command copying numpy/distutils/command/scons.py -> build/lib.linux-i686-2.5/numpy/distutils/command copying numpy/distutils/command/build_src.py -> build/lib.linux-i686-2.5/numpy/distutils/command copying numpy/distutils/command/build_py.py -> build/lib.linux-i686-2.5/numpy/distutils/command copying numpy/distutils/command/build_ext.py -> build/lib.linux-i686-2.5/numpy/distutils/command copying numpy/distutils/command/install_data.py -> build/lib.linux-i686-2.5/numpy/distutils/command copying numpy/distutils/command/build_scripts.py -> build/lib.linux-i686-2.5/numpy/distutils/command copying numpy/distutils/command/develop.py -> build/lib.linux-i686-2.5/numpy/distutils/command copying numpy/distutils/command/build_clib.py -> build/lib.linux-i686-2.5/numpy/distutils/command copying numpy/distutils/command/config.py -> build/lib.linux-i686-2.5/numpy/distutils/command copying numpy/distutils/command/bdist_rpm.py -> build/lib.linux-i686-2.5/numpy/distutils/command copying numpy/distutils/command/install_headers.py -> build/lib.linux-i686-2.5/numpy/distutils/command copying numpy/distutils/command/sdist.py -> build/lib.linux-i686-2.5/numpy/distutils/command creating build/lib.linux-i686-2.5/numpy/distutils/fcompiler copying numpy/distutils/fcompiler/absoft.py -> build/lib.linux-i686-2.5/numpy/distutils/fcompiler copying numpy/distutils/fcompiler/mips.py -> build/lib.linux-i686-2.5/numpy/distutils/fcompiler copying numpy/distutils/fcompiler/vast.py -> build/lib.linux-i686-2.5/numpy/distutils/fcompiler copying numpy/distutils/fcompiler/none.py -> build/lib.linux-i686-2.5/numpy/distutils/fcompiler copying numpy/distutils/fcompiler/nag.py -> build/lib.linux-i686-2.5/numpy/distutils/fcompiler copying numpy/distutils/fcompiler/lahey.py -> build/lib.linux-i686-2.5/numpy/distutils/fcompiler copying numpy/distutils/fcompiler/__init__.py -> build/lib.linux-i686-2.5/numpy/distutils/fcompiler copying numpy/distutils/fcompiler/g95.py -> build/lib.linux-i686-2.5/numpy/distutils/fcompiler copying numpy/distutils/fcompiler/pg.py -> build/lib.linux-i686-2.5/numpy/distutils/fcompiler copying numpy/distutils/fcompiler/ibm.py -> build/lib.linux-i686-2.5/numpy/distutils/fcompiler copying numpy/distutils/fcompiler/hpux.py -> build/lib.linux-i686-2.5/numpy/distutils/fcompiler copying numpy/distutils/fcompiler/compaq.py -> build/lib.linux-i686-2.5/numpy/distutils/fcompiler copying numpy/distutils/fcompiler/intel.py -> build/lib.linux-i686-2.5/numpy/distutils/fcompiler copying numpy/distutils/fcompiler/sun.py -> build/lib.linux-i686-2.5/numpy/distutils/fcompiler copying numpy/distutils/fcompiler/gnu.py -> build/lib.linux-i686-2.5/numpy/distutils/fcompiler creating build/lib.linux-i686-2.5/numpy/testing copying numpy/testing/numpytest.py -> build/lib.linux-i686-2.5/numpy/testing copying numpy/testing/parametric.py -> build/lib.linux-i686-2.5/numpy/testing copying numpy/testing/setup.py -> build/lib.linux-i686-2.5/numpy/testing copying numpy/testing/__init__.py -> build/lib.linux-i686-2.5/numpy/testing copying numpy/testing/nosetester.py -> build/lib.linux-i686-2.5/numpy/testing copying numpy/testing/noseclasses.py -> build/lib.linux-i686-2.5/numpy/testing copying numpy/testing/decorators.py -> build/lib.linux-i686-2.5/numpy/testing copying numpy/testing/nulltester.py -> build/lib.linux-i686-2.5/numpy/testing copying numpy/testing/setupscons.py -> build/lib.linux-i686-2.5/numpy/testing copying numpy/testing/utils.py -> build/lib.linux-i686-2.5/numpy/testing creating build/lib.linux-i686-2.5/numpy/f2py copying numpy/f2py/f2py2e.py -> build/lib.linux-i686-2.5/numpy/f2py copying numpy/f2py/f90mod_rules.py -> build/lib.linux-i686-2.5/numpy/f2py copying numpy/f2py/setup.py -> build/lib.linux-i686-2.5/numpy/f2py copying numpy/f2py/crackfortran.py -> build/lib.linux-i686-2.5/numpy/f2py copying numpy/f2py/__init__.py -> build/lib.linux-i686-2.5/numpy/f2py copying numpy/f2py/rules.py -> build/lib.linux-i686-2.5/numpy/f2py copying numpy/f2py/use_rules.py -> build/lib.linux-i686-2.5/numpy/f2py copying numpy/f2py/common_rules.py -> build/lib.linux-i686-2.5/numpy/f2py copying numpy/f2py/__version__.py -> build/lib.linux-i686-2.5/numpy/f2py copying numpy/f2py/func2subr.py -> build/lib.linux-i686-2.5/numpy/f2py copying numpy/f2py/info.py -> build/lib.linux-i686-2.5/numpy/f2py copying numpy/f2py/__svn_version__.py -> build/lib.linux-i686-2.5/numpy/f2py copying numpy/f2py/cb_rules.py -> build/lib.linux-i686-2.5/numpy/f2py copying numpy/f2py/auxfuncs.py -> build/lib.linux-i686-2.5/numpy/f2py copying numpy/f2py/setupscons.py -> build/lib.linux-i686-2.5/numpy/f2py copying numpy/f2py/f2py_testing.py -> build/lib.linux-i686-2.5/numpy/f2py copying numpy/f2py/capi_maps.py -> build/lib.linux-i686-2.5/numpy/f2py copying numpy/f2py/diagnose.py -> build/lib.linux-i686-2.5/numpy/f2py copying numpy/f2py/cfuncs.py -> build/lib.linux-i686-2.5/numpy/f2py creating build/lib.linux-i686-2.5/numpy/core copying numpy/core/arrayprint.py -> build/lib.linux-i686-2.5/numpy/core copying numpy/core/_internal.py -> build/lib.linux-i686-2.5/numpy/core copying numpy/core/defchararray.py -> build/lib.linux-i686-2.5/numpy/core copying numpy/core/setup.py -> build/lib.linux-i686-2.5/numpy/core copying numpy/core/__init__.py -> build/lib.linux-i686-2.5/numpy/core copying numpy/core/records.py -> build/lib.linux-i686-2.5/numpy/core copying numpy/core/defmatrix.py -> build/lib.linux-i686-2.5/numpy/core copying numpy/core/info.py -> build/lib.linux-i686-2.5/numpy/core copying numpy/core/scons_support.py -> build/lib.linux-i686-2.5/numpy/core copying numpy/core/__svn_version__.py -> build/lib.linux-i686-2.5/numpy/core copying numpy/core/numeric.py -> build/lib.linux-i686-2.5/numpy/core copying numpy/core/setupscons.py -> build/lib.linux-i686-2.5/numpy/core copying numpy/core/numerictypes.py -> build/lib.linux-i686-2.5/numpy/core copying numpy/core/fromnumeric.py -> build/lib.linux-i686-2.5/numpy/core copying numpy/core/memmap.py -> build/lib.linux-i686-2.5/numpy/core copying numpy/core/code_generators/generate_numpy_api.py -> build/lib.linux-i686-2.5/numpy/core creating build/lib.linux-i686-2.5/numpy/lib copying numpy/lib/format.py -> build/lib.linux-i686-2.5/numpy/lib copying numpy/lib/function_base.py -> build/lib.linux-i686-2.5/numpy/lib copying numpy/lib/_datasource.py -> build/lib.linux-i686-2.5/numpy/lib copying numpy/lib/scimath.py -> build/lib.linux-i686-2.5/numpy/lib copying numpy/lib/type_check.py -> build/lib.linux-i686-2.5/numpy/lib copying numpy/lib/setup.py -> build/lib.linux-i686-2.5/numpy/lib copying numpy/lib/index_tricks.py -> build/lib.linux-i686-2.5/numpy/lib copying numpy/lib/__init__.py -> build/lib.linux-i686-2.5/numpy/lib copying numpy/lib/twodim_base.py -> build/lib.linux-i686-2.5/numpy/lib copying numpy/lib/machar.py -> build/lib.linux-i686-2.5/numpy/lib copying numpy/lib/getlimits.py -> build/lib.linux-i686-2.5/numpy/lib copying numpy/lib/stride_tricks.py -> build/lib.linux-i686-2.5/numpy/lib copying numpy/lib/info.py -> build/lib.linux-i686-2.5/numpy/lib copying numpy/lib/financial.py -> build/lib.linux-i686-2.5/numpy/lib copying numpy/lib/ufunclike.py -> build/lib.linux-i686-2.5/numpy/lib copying numpy/lib/setupscons.py -> build/lib.linux-i686-2.5/numpy/lib copying numpy/lib/io.py -> build/lib.linux-i686-2.5/numpy/lib copying numpy/lib/shape_base.py -> build/lib.linux-i686-2.5/numpy/lib copying numpy/lib/utils.py -> build/lib.linux-i686-2.5/numpy/lib copying numpy/lib/polynomial.py -> build/lib.linux-i686-2.5/numpy/lib copying numpy/lib/user_array.py -> build/lib.linux-i686-2.5/numpy/lib copying numpy/lib/arraysetops.py -> build/lib.linux-i686-2.5/numpy/lib copying numpy/lib/arrayterator.py -> build/lib.linux-i686-2.5/numpy/lib creating build/lib.linux-i686-2.5/numpy/oldnumeric copying numpy/oldnumeric/linear_algebra.py -> build/lib.linux-i686-2.5/numpy/oldnumeric copying numpy/oldnumeric/compat.py -> build/lib.linux-i686-2.5/numpy/oldnumeric copying numpy/oldnumeric/arrayfns.py -> build/lib.linux-i686-2.5/numpy/oldnumeric copying numpy/oldnumeric/setup.py -> build/lib.linux-i686-2.5/numpy/oldnumeric copying numpy/oldnumeric/__init__.py -> build/lib.linux-i686-2.5/numpy/oldnumeric copying numpy/oldnumeric/precision.py -> build/lib.linux-i686-2.5/numpy/oldnumeric copying numpy/oldnumeric/functions.py -> build/lib.linux-i686-2.5/numpy/oldnumeric copying numpy/oldnumeric/mlab.py -> build/lib.linux-i686-2.5/numpy/oldnumeric copying numpy/oldnumeric/random_array.py -> build/lib.linux-i686-2.5/numpy/oldnumeric copying numpy/oldnumeric/ufuncs.py -> build/lib.linux-i686-2.5/numpy/oldnumeric copying numpy/oldnumeric/typeconv.py -> build/lib.linux-i686-2.5/numpy/oldnumeric copying numpy/oldnumeric/misc.py -> build/lib.linux-i686-2.5/numpy/oldnumeric copying numpy/oldnumeric/rng_stats.py -> build/lib.linux-i686-2.5/numpy/oldnumeric copying numpy/oldnumeric/rng.py -> build/lib.linux-i686-2.5/numpy/oldnumeric copying numpy/oldnumeric/fft.py -> build/lib.linux-i686-2.5/numpy/oldnumeric copying numpy/oldnumeric/alter_code2.py -> build/lib.linux-i686-2.5/numpy/oldnumeric copying numpy/oldnumeric/array_printer.py -> build/lib.linux-i686-2.5/numpy/oldnumeric copying numpy/oldnumeric/setupscons.py -> build/lib.linux-i686-2.5/numpy/oldnumeric copying numpy/oldnumeric/ma.py -> build/lib.linux-i686-2.5/numpy/oldnumeric copying numpy/oldnumeric/matrix.py -> build/lib.linux-i686-2.5/numpy/oldnumeric copying numpy/oldnumeric/alter_code1.py -> build/lib.linux-i686-2.5/numpy/oldnumeric copying numpy/oldnumeric/fix_default_axis.py -> build/lib.linux-i686-2.5/numpy/oldnumeric copying numpy/oldnumeric/user_array.py -> build/lib.linux-i686-2.5/numpy/oldnumeric creating build/lib.linux-i686-2.5/numpy/numarray copying numpy/numarray/linear_algebra.py -> build/lib.linux-i686-2.5/numpy/numarray copying numpy/numarray/compat.py -> build/lib.linux-i686-2.5/numpy/numarray copying numpy/numarray/setup.py -> build/lib.linux-i686-2.5/numpy/numarray copying numpy/numarray/__init__.py -> build/lib.linux-i686-2.5/numpy/numarray copying numpy/numarray/functions.py -> build/lib.linux-i686-2.5/numpy/numarray copying numpy/numarray/mlab.py -> build/lib.linux-i686-2.5/numpy/numarray copying numpy/numarray/random_array.py -> build/lib.linux-i686-2.5/numpy/numarray copying numpy/numarray/ufuncs.py -> build/lib.linux-i686-2.5/numpy/numarray copying numpy/numarray/nd_image.py -> build/lib.linux-i686-2.5/numpy/numarray copying numpy/numarray/convolve.py -> build/lib.linux-i686-2.5/numpy/numarray copying numpy/numarray/fft.py -> build/lib.linux-i686-2.5/numpy/numarray copying numpy/numarray/session.py -> build/lib.linux-i686-2.5/numpy/numarray copying numpy/numarray/alter_code2.py -> build/lib.linux-i686-2.5/numpy/numarray copying numpy/numarray/util.py -> build/lib.linux-i686-2.5/numpy/numarray copying numpy/numarray/setupscons.py -> build/lib.linux-i686-2.5/numpy/numarray copying numpy/numarray/numerictypes.py -> build/lib.linux-i686-2.5/numpy/numarray copying numpy/numarray/ma.py -> build/lib.linux-i686-2.5/numpy/numarray copying numpy/numarray/matrix.py -> build/lib.linux-i686-2.5/numpy/numarray copying numpy/numarray/alter_code1.py -> build/lib.linux-i686-2.5/numpy/numarray copying numpy/numarray/image.py -> build/lib.linux-i686-2.5/numpy/numarray creating build/lib.linux-i686-2.5/numpy/fft copying numpy/fft/setup.py -> build/lib.linux-i686-2.5/numpy/fft copying numpy/fft/__init__.py -> build/lib.linux-i686-2.5/numpy/fft copying numpy/fft/info.py -> build/lib.linux-i686-2.5/numpy/fft copying numpy/fft/fftpack.py -> build/lib.linux-i686-2.5/numpy/fft copying numpy/fft/setupscons.py -> build/lib.linux-i686-2.5/numpy/fft copying numpy/fft/helper.py -> build/lib.linux-i686-2.5/numpy/fft creating build/lib.linux-i686-2.5/numpy/linalg copying numpy/linalg/setup.py -> build/lib.linux-i686-2.5/numpy/linalg copying numpy/linalg/__init__.py -> build/lib.linux-i686-2.5/numpy/linalg copying numpy/linalg/linalg.py -> build/lib.linux-i686-2.5/numpy/linalg copying numpy/linalg/info.py -> build/lib.linux-i686-2.5/numpy/linalg copying numpy/linalg/setupscons.py -> build/lib.linux-i686-2.5/numpy/linalg creating build/lib.linux-i686-2.5/numpy/random copying numpy/random/setup.py -> build/lib.linux-i686-2.5/numpy/random copying numpy/random/__init__.py -> build/lib.linux-i686-2.5/numpy/random copying numpy/random/info.py -> build/lib.linux-i686-2.5/numpy/random copying numpy/random/setupscons.py -> build/lib.linux-i686-2.5/numpy/random creating build/lib.linux-i686-2.5/numpy/ma copying numpy/ma/version.py -> build/lib.linux-i686-2.5/numpy/ma copying numpy/ma/setup.py -> build/lib.linux-i686-2.5/numpy/ma copying numpy/ma/__init__.py -> build/lib.linux-i686-2.5/numpy/ma copying numpy/ma/core.py -> build/lib.linux-i686-2.5/numpy/ma copying numpy/ma/extras.py -> build/lib.linux-i686-2.5/numpy/ma copying numpy/ma/testutils.py -> build/lib.linux-i686-2.5/numpy/ma copying numpy/ma/mrecords.py -> build/lib.linux-i686-2.5/numpy/ma copying numpy/ma/setupscons.py -> build/lib.linux-i686-2.5/numpy/ma copying numpy/ma/timer_comparison.py -> build/lib.linux-i686-2.5/numpy/ma copying numpy/ma/bench.py -> build/lib.linux-i686-2.5/numpy/ma creating build/lib.linux-i686-2.5/numpy/doc copying numpy/doc/broadcasting.py -> build/lib.linux-i686-2.5/numpy/doc copying numpy/doc/basics.py -> build/lib.linux-i686-2.5/numpy/doc copying numpy/doc/internals.py -> build/lib.linux-i686-2.5/numpy/doc copying numpy/doc/indexing.py -> build/lib.linux-i686-2.5/numpy/doc copying numpy/doc/__init__.py -> build/lib.linux-i686-2.5/numpy/doc copying numpy/doc/howtofind.py -> build/lib.linux-i686-2.5/numpy/doc copying numpy/doc/subclassing.py -> build/lib.linux-i686-2.5/numpy/doc copying numpy/doc/ufuncs.py -> build/lib.linux-i686-2.5/numpy/doc copying numpy/doc/misc.py -> build/lib.linux-i686-2.5/numpy/doc copying numpy/doc/jargon.py -> build/lib.linux-i686-2.5/numpy/doc copying numpy/doc/methods_vs_functions.py -> build/lib.linux-i686-2.5/numpy/doc copying numpy/doc/structured_arrays.py -> build/lib.linux-i686-2.5/numpy/doc copying numpy/doc/creation.py -> build/lib.linux-i686-2.5/numpy/doc copying numpy/doc/performance.py -> build/lib.linux-i686-2.5/numpy/doc copying numpy/doc/glossary.py -> build/lib.linux-i686-2.5/numpy/doc copying numpy/doc/io.py -> build/lib.linux-i686-2.5/numpy/doc running build_ext customize UnixCCompiler customize UnixCCompiler using build_ext customize GnuFCompiler gnu: no Fortran 90 compiler found gnu: no Fortran 90 compiler found customize GnuFCompiler gnu: no Fortran 90 compiler found gnu: no Fortran 90 compiler found customize GnuFCompiler using build_ext building 'numpy.core.multiarray' extension compiling C sources C compiler: gcc -pthread -fno-strict-aliasing -DNDEBUG -g -fwrapv -O2 -Wall -Wstrict-prototypes -fPIC creating build/temp.linux-i686-2.5 creating build/temp.linux-i686-2.5/numpy creating build/temp.linux-i686-2.5/numpy/core creating build/temp.linux-i686-2.5/numpy/core/src compile options: '-Ibuild/src.linux-i686-2.5/numpy/core/src -Inumpy/core/include -Ibuild/src.linux-i686-2.5/numpy/core/include/numpy -Inumpy/core/src -Inumpy/core/include -I/usr/include/python2.5 -c' gcc: numpy/core/src/multiarraymodule.c gcc -pthread -shared -Wl,-O1 -Wl,-Bsymbolic-functions build/temp.linux-i686-2.5/numpy/core/src/multiarraymodule.o -lm -lm -o build/lib.linux-i686-2.5/numpy/core/multiarray.so building 'numpy.core.umath' extension compiling C sources C compiler: gcc -pthread -fno-strict-aliasing -DNDEBUG -g -fwrapv -O2 -Wall -Wstrict-prototypes -fPIC creating build/temp.linux-i686-2.5/build creating build/temp.linux-i686-2.5/build/src.linux-i686-2.5 creating build/temp.linux-i686-2.5/build/src.linux-i686-2.5/numpy creating build/temp.linux-i686-2.5/build/src.linux-i686-2.5/numpy/core creating build/temp.linux-i686-2.5/build/src.linux-i686-2.5/numpy/core/src compile options: '-Ibuild/src.linux-i686-2.5/numpy/core/src -Inumpy/core/include -Ibuild/src.linux-i686-2.5/numpy/core/include/numpy -Inumpy/core/src -Inumpy/core/include -I/usr/include/python2.5 -c' gcc: build/src.linux-i686-2.5/numpy/core/src/umathmodule.c gcc -pthread -shared -Wl,-O1 -Wl,-Bsymbolic-functions build/temp.linux-i686-2.5/build/src.linux-i686-2.5/numpy/core/src/umathmodule.o -lm -o build/lib.linux-i686-2.5/numpy/core/umath.so building 'numpy.core._sort' extension compiling C sources C compiler: gcc -pthread -fno-strict-aliasing -DNDEBUG -g -fwrapv -O2 -Wall -Wstrict-prototypes -fPIC compile options: '-Inumpy/core/include -Ibuild/src.linux-i686-2.5/numpy/core/include/numpy -Inumpy/core/src -Inumpy/core/include -I/usr/include/python2.5 -c' gcc: build/src.linux-i686-2.5/numpy/core/src/_sortmodule.c gcc -pthread -shared -Wl,-O1 -Wl,-Bsymbolic-functions build/temp.linux-i686-2.5/build/src.linux-i686-2.5/numpy/core/src/_sortmodule.o -lm -o build/lib.linux-i686-2.5/numpy/core/_sort.so building 'numpy.core.scalarmath' extension compiling C sources C compiler: gcc -pthread -fno-strict-aliasing -DNDEBUG -g -fwrapv -O2 -Wall -Wstrict-prototypes -fPIC compile options: '-Inumpy/core/include -Ibuild/src.linux-i686-2.5/numpy/core/include/numpy -Inumpy/core/src -Inumpy/core/include -I/usr/include/python2.5 -c' gcc: build/src.linux-i686-2.5/numpy/core/src/scalarmathmodule.c gcc -pthread -shared -Wl,-O1 -Wl,-Bsymbolic-functions build/temp.linux-i686-2.5/build/src.linux-i686-2.5/numpy/core/src/scalarmathmodule.o -lm -o build/lib.linux-i686-2.5/numpy/core/scalarmath.so building 'numpy.lib._compiled_base' extension compiling C sources C compiler: gcc -pthread -fno-strict-aliasing -DNDEBUG -g -fwrapv -O2 -Wall -Wstrict-prototypes -fPIC creating build/temp.linux-i686-2.5/numpy/lib creating build/temp.linux-i686-2.5/numpy/lib/src compile options: '-Inumpy/core/include -Ibuild/src.linux-i686-2.5/numpy/core/include/numpy -Inumpy/core/src -Inumpy/core/include -I/usr/include/python2.5 -c' gcc: numpy/lib/src/_compiled_base.c gcc -pthread -shared -Wl,-O1 -Wl,-Bsymbolic-functions build/temp.linux-i686-2.5/numpy/lib/src/_compiled_base.o -o build/lib.linux-i686-2.5/numpy/lib/_compiled_base.so building 'numpy.numarray._capi' extension compiling C sources C compiler: gcc -pthread -fno-strict-aliasing -DNDEBUG -g -fwrapv -O2 -Wall -Wstrict-prototypes -fPIC creating build/temp.linux-i686-2.5/numpy/numarray compile options: '-Inumpy/core/include -Ibuild/src.linux-i686-2.5/numpy/core/include/numpy -Inumpy/core/src -Inumpy/core/include -I/usr/include/python2.5 -c' gcc: numpy/numarray/_capi.c gcc -pthread -shared -Wl,-O1 -Wl,-Bsymbolic-functions build/temp.linux-i686-2.5/numpy/numarray/_capi.o -o build/lib.linux-i686-2.5/numpy/numarray/_capi.so building 'numpy.fft.fftpack_lite' extension compiling C sources C compiler: gcc -pthread -fno-strict-aliasing -DNDEBUG -g -fwrapv -O2 -Wall -Wstrict-prototypes -fPIC creating build/temp.linux-i686-2.5/numpy/fft compile options: '-Inumpy/core/include -Ibuild/src.linux-i686-2.5/numpy/core/include/numpy -Inumpy/core/src -Inumpy/core/include -I/usr/include/python2.5 -c' gcc: numpy/fft/fftpack.c gcc: numpy/fft/fftpack_litemodule.c gcc -pthread -shared -Wl,-O1 -Wl,-Bsymbolic-functions build/temp.linux-i686-2.5/numpy/fft/fftpack_litemodule.o build/temp.linux-i686-2.5/numpy/fft/fftpack.o -o build/lib.linux-i686-2.5/numpy/fft/fftpack_lite.so building 'numpy.linalg.lapack_lite' extension compiling C sources C compiler: gcc -pthread -fno-strict-aliasing -DNDEBUG -g -fwrapv -O2 -Wall -Wstrict-prototypes -fPIC creating build/temp.linux-i686-2.5/numpy/linalg compile options: '-DNO_ATLAS_INFO=1 -Inumpy/core/include -Ibuild/src.linux-i686-2.5/numpy/core/include/numpy -Inumpy/core/src -Inumpy/core/include -I/usr/include/python2.5 -c' gcc: numpy/linalg/lapack_litemodule.c gcc: numpy/linalg/python_xerbla.c /usr/bin/g77 -g -Wall -g -Wall -shared build/temp.linux-i686-2.5/numpy/linalg/lapack_litemodule.o build/temp.linux-i686-2.5/numpy/linalg/python_xerbla.o -L/usr/lib -llapack -lblas -lg2c -o build/lib.linux-i686-2.5/numpy/linalg/lapack_lite.so building 'numpy.random.mtrand' extension compiling C sources C compiler: gcc -pthread -fno-strict-aliasing -DNDEBUG -g -fwrapv -O2 -Wall -Wstrict-prototypes -fPIC creating build/temp.linux-i686-2.5/numpy/random creating build/temp.linux-i686-2.5/numpy/random/mtrand compile options: '-Inumpy/core/include -Ibuild/src.linux-i686-2.5/numpy/core/include/numpy -Inumpy/core/src -Inumpy/core/include -I/usr/include/python2.5 -c' gcc: numpy/random/mtrand/distributions.c gcc: numpy/random/mtrand/initarray.c gcc: numpy/random/mtrand/randomkit.c gcc: numpy/random/mtrand/mtrand.c gcc -pthread -shared -Wl,-O1 -Wl,-Bsymbolic-functions build/temp.linux-i686-2.5/numpy/random/mtrand/mtrand.o build/temp.linux-i686-2.5/numpy/random/mtrand/randomkit.o build/temp.linux-i686-2.5/numpy/random/mtrand/initarray.o build/temp.linux-i686-2.5/numpy/random/mtrand/distributions.o -o build/lib.linux-i686-2.5/numpy/random/mtrand.so running scons running build_scripts creating build/scripts.linux-i686-2.5 Creating build/scripts.linux-i686-2.5/f2py adding 'build/scripts.linux-i686-2.5/f2py' to scripts changing mode of build/scripts.linux-i686-2.5/f2py from 644 to 755 running install_lib creating /usr/lib/python2.5/site-packages/numpy creating /usr/lib/python2.5/site-packages/numpy/testing copying build/lib.linux-i686-2.5/numpy/testing/numpytest.py -> /usr/lib/python2.5/site-packages/numpy/testing copying build/lib.linux-i686-2.5/numpy/testing/parametric.py -> /usr/lib/python2.5/site-packages/numpy/testing copying build/lib.linux-i686-2.5/numpy/testing/setup.py -> /usr/lib/python2.5/site-packages/numpy/testing copying build/lib.linux-i686-2.5/numpy/testing/__init__.py -> /usr/lib/python2.5/site-packages/numpy/testing copying build/lib.linux-i686-2.5/numpy/testing/nosetester.py -> /usr/lib/python2.5/site-packages/numpy/testing copying build/lib.linux-i686-2.5/numpy/testing/noseclasses.py -> /usr/lib/python2.5/site-packages/numpy/testing copying build/lib.linux-i686-2.5/numpy/testing/decorators.py -> /usr/lib/python2.5/site-packages/numpy/testing copying build/lib.linux-i686-2.5/numpy/testing/nulltester.py -> /usr/lib/python2.5/site-packages/numpy/testing copying build/lib.linux-i686-2.5/numpy/testing/setupscons.py -> /usr/lib/python2.5/site-packages/numpy/testing copying build/lib.linux-i686-2.5/numpy/testing/utils.py -> /usr/lib/python2.5/site-packages/numpy/testing copying build/lib.linux-i686-2.5/numpy/version.py -> /usr/lib/python2.5/site-packages/numpy creating /usr/lib/python2.5/site-packages/numpy/lib copying build/lib.linux-i686-2.5/numpy/lib/format.py -> /usr/lib/python2.5/site-packages/numpy/lib copying build/lib.linux-i686-2.5/numpy/lib/_compiled_base.so -> /usr/lib/python2.5/site-packages/numpy/lib copying build/lib.linux-i686-2.5/numpy/lib/function_base.py -> /usr/lib/python2.5/site-packages/numpy/lib copying build/lib.linux-i686-2.5/numpy/lib/_datasource.py -> /usr/lib/python2.5/site-packages/numpy/lib copying build/lib.linux-i686-2.5/numpy/lib/scimath.py -> /usr/lib/python2.5/site-packages/numpy/lib copying build/lib.linux-i686-2.5/numpy/lib/type_check.py -> /usr/lib/python2.5/site-packages/numpy/lib copying build/lib.linux-i686-2.5/numpy/lib/setup.py -> /usr/lib/python2.5/site-packages/numpy/lib copying build/lib.linux-i686-2.5/numpy/lib/index_tricks.py -> /usr/lib/python2.5/site-packages/numpy/lib copying build/lib.linux-i686-2.5/numpy/lib/__init__.py -> /usr/lib/python2.5/site-packages/numpy/lib copying build/lib.linux-i686-2.5/numpy/lib/twodim_base.py -> /usr/lib/python2.5/site-packages/numpy/lib copying build/lib.linux-i686-2.5/numpy/lib/machar.py -> /usr/lib/python2.5/site-packages/numpy/lib copying build/lib.linux-i686-2.5/numpy/lib/getlimits.py -> /usr/lib/python2.5/site-packages/numpy/lib copying build/lib.linux-i686-2.5/numpy/lib/stride_tricks.py -> /usr/lib/python2.5/site-packages/numpy/lib copying build/lib.linux-i686-2.5/numpy/lib/info.py -> /usr/lib/python2.5/site-packages/numpy/lib copying build/lib.linux-i686-2.5/numpy/lib/financial.py -> /usr/lib/python2.5/site-packages/numpy/lib copying build/lib.linux-i686-2.5/numpy/lib/ufunclike.py -> /usr/lib/python2.5/site-packages/numpy/lib copying build/lib.linux-i686-2.5/numpy/lib/setupscons.py -> /usr/lib/python2.5/site-packages/numpy/lib copying build/lib.linux-i686-2.5/numpy/lib/io.py -> /usr/lib/python2.5/site-packages/numpy/lib copying build/lib.linux-i686-2.5/numpy/lib/shape_base.py -> /usr/lib/python2.5/site-packages/numpy/lib copying build/lib.linux-i686-2.5/numpy/lib/utils.py -> /usr/lib/python2.5/site-packages/numpy/lib copying build/lib.linux-i686-2.5/numpy/lib/polynomial.py -> /usr/lib/python2.5/site-packages/numpy/lib copying build/lib.linux-i686-2.5/numpy/lib/user_array.py -> /usr/lib/python2.5/site-packages/numpy/lib copying build/lib.linux-i686-2.5/numpy/lib/arraysetops.py -> /usr/lib/python2.5/site-packages/numpy/lib copying build/lib.linux-i686-2.5/numpy/lib/arrayterator.py -> /usr/lib/python2.5/site-packages/numpy/lib creating /usr/lib/python2.5/site-packages/numpy/random copying build/lib.linux-i686-2.5/numpy/random/setup.py -> /usr/lib/python2.5/site-packages/numpy/random copying build/lib.linux-i686-2.5/numpy/random/__init__.py -> /usr/lib/python2.5/site-packages/numpy/random copying build/lib.linux-i686-2.5/numpy/random/mtrand.so -> /usr/lib/python2.5/site-packages/numpy/random copying build/lib.linux-i686-2.5/numpy/random/info.py -> /usr/lib/python2.5/site-packages/numpy/random copying build/lib.linux-i686-2.5/numpy/random/setupscons.py -> /usr/lib/python2.5/site-packages/numpy/random copying build/lib.linux-i686-2.5/numpy/ctypeslib.py -> /usr/lib/python2.5/site-packages/numpy creating /usr/lib/python2.5/site-packages/numpy/numarray copying build/lib.linux-i686-2.5/numpy/numarray/linear_algebra.py -> /usr/lib/python2.5/site-packages/numpy/numarray copying build/lib.linux-i686-2.5/numpy/numarray/compat.py -> /usr/lib/python2.5/site-packages/numpy/numarray copying build/lib.linux-i686-2.5/numpy/numarray/_capi.so -> /usr/lib/python2.5/site-packages/numpy/numarray copying build/lib.linux-i686-2.5/numpy/numarray/setup.py -> /usr/lib/python2.5/site-packages/numpy/numarray copying build/lib.linux-i686-2.5/numpy/numarray/__init__.py -> /usr/lib/python2.5/site-packages/numpy/numarray copying build/lib.linux-i686-2.5/numpy/numarray/functions.py -> /usr/lib/python2.5/site-packages/numpy/numarray copying build/lib.linux-i686-2.5/numpy/numarray/mlab.py -> /usr/lib/python2.5/site-packages/numpy/numarray copying build/lib.linux-i686-2.5/numpy/numarray/random_array.py -> /usr/lib/python2.5/site-packages/numpy/numarray copying build/lib.linux-i686-2.5/numpy/numarray/ufuncs.py -> /usr/lib/python2.5/site-packages/numpy/numarray copying build/lib.linux-i686-2.5/numpy/numarray/nd_image.py -> /usr/lib/python2.5/site-packages/numpy/numarray copying build/lib.linux-i686-2.5/numpy/numarray/convolve.py -> /usr/lib/python2.5/site-packages/numpy/numarray copying build/lib.linux-i686-2.5/numpy/numarray/fft.py -> /usr/lib/python2.5/site-packages/numpy/numarray copying build/lib.linux-i686-2.5/numpy/numarray/session.py -> /usr/lib/python2.5/site-packages/numpy/numarray copying build/lib.linux-i686-2.5/numpy/numarray/alter_code2.py -> /usr/lib/python2.5/site-packages/numpy/numarray copying build/lib.linux-i686-2.5/numpy/numarray/util.py -> /usr/lib/python2.5/site-packages/numpy/numarray copying build/lib.linux-i686-2.5/numpy/numarray/setupscons.py -> /usr/lib/python2.5/site-packages/numpy/numarray copying build/lib.linux-i686-2.5/numpy/numarray/numerictypes.py -> /usr/lib/python2.5/site-packages/numpy/numarray copying build/lib.linux-i686-2.5/numpy/numarray/ma.py -> /usr/lib/python2.5/site-packages/numpy/numarray copying build/lib.linux-i686-2.5/numpy/numarray/matrix.py -> /usr/lib/python2.5/site-packages/numpy/numarray copying build/lib.linux-i686-2.5/numpy/numarray/alter_code1.py -> /usr/lib/python2.5/site-packages/numpy/numarray copying build/lib.linux-i686-2.5/numpy/numarray/image.py -> /usr/lib/python2.5/site-packages/numpy/numarray copying build/lib.linux-i686-2.5/numpy/setup.py -> /usr/lib/python2.5/site-packages/numpy creating /usr/lib/python2.5/site-packages/numpy/f2py copying build/lib.linux-i686-2.5/numpy/f2py/f2py2e.py -> /usr/lib/python2.5/site-packages/numpy/f2py copying build/lib.linux-i686-2.5/numpy/f2py/f90mod_rules.py -> /usr/lib/python2.5/site-packages/numpy/f2py copying build/lib.linux-i686-2.5/numpy/f2py/setup.py -> /usr/lib/python2.5/site-packages/numpy/f2py copying build/lib.linux-i686-2.5/numpy/f2py/crackfortran.py -> /usr/lib/python2.5/site-packages/numpy/f2py copying build/lib.linux-i686-2.5/numpy/f2py/__init__.py -> /usr/lib/python2.5/site-packages/numpy/f2py copying build/lib.linux-i686-2.5/numpy/f2py/rules.py -> /usr/lib/python2.5/site-packages/numpy/f2py copying build/lib.linux-i686-2.5/numpy/f2py/use_rules.py -> /usr/lib/python2.5/site-packages/numpy/f2py copying build/lib.linux-i686-2.5/numpy/f2py/common_rules.py -> /usr/lib/python2.5/site-packages/numpy/f2py copying build/lib.linux-i686-2.5/numpy/f2py/__version__.py -> /usr/lib/python2.5/site-packages/numpy/f2py copying build/lib.linux-i686-2.5/numpy/f2py/func2subr.py -> /usr/lib/python2.5/site-packages/numpy/f2py copying build/lib.linux-i686-2.5/numpy/f2py/info.py -> /usr/lib/python2.5/site-packages/numpy/f2py copying build/lib.linux-i686-2.5/numpy/f2py/__svn_version__.py -> /usr/lib/python2.5/site-packages/numpy/f2py copying build/lib.linux-i686-2.5/numpy/f2py/cb_rules.py -> /usr/lib/python2.5/site-packages/numpy/f2py copying build/lib.linux-i686-2.5/numpy/f2py/auxfuncs.py -> /usr/lib/python2.5/site-packages/numpy/f2py copying build/lib.linux-i686-2.5/numpy/f2py/setupscons.py -> /usr/lib/python2.5/site-packages/numpy/f2py copying build/lib.linux-i686-2.5/numpy/f2py/f2py_testing.py -> /usr/lib/python2.5/site-packages/numpy/f2py copying build/lib.linux-i686-2.5/numpy/f2py/capi_maps.py -> /usr/lib/python2.5/site-packages/numpy/f2py copying build/lib.linux-i686-2.5/numpy/f2py/diagnose.py -> /usr/lib/python2.5/site-packages/numpy/f2py copying build/lib.linux-i686-2.5/numpy/f2py/cfuncs.py -> /usr/lib/python2.5/site-packages/numpy/f2py copying build/lib.linux-i686-2.5/numpy/__init__.py -> /usr/lib/python2.5/site-packages/numpy copying build/lib.linux-i686-2.5/numpy/dual.py -> /usr/lib/python2.5/site-packages/numpy creating /usr/lib/python2.5/site-packages/numpy/oldnumeric copying build/lib.linux-i686-2.5/numpy/oldnumeric/linear_algebra.py -> /usr/lib/python2.5/site-packages/numpy/oldnumeric copying build/lib.linux-i686-2.5/numpy/oldnumeric/compat.py -> /usr/lib/python2.5/site-packages/numpy/oldnumeric copying build/lib.linux-i686-2.5/numpy/oldnumeric/arrayfns.py -> /usr/lib/python2.5/site-packages/numpy/oldnumeric copying build/lib.linux-i686-2.5/numpy/oldnumeric/setup.py -> /usr/lib/python2.5/site-packages/numpy/oldnumeric copying build/lib.linux-i686-2.5/numpy/oldnumeric/__init__.py -> /usr/lib/python2.5/site-packages/numpy/oldnumeric copying build/lib.linux-i686-2.5/numpy/oldnumeric/precision.py -> /usr/lib/python2.5/site-packages/numpy/oldnumeric copying build/lib.linux-i686-2.5/numpy/oldnumeric/functions.py -> /usr/lib/python2.5/site-packages/numpy/oldnumeric copying build/lib.linux-i686-2.5/numpy/oldnumeric/mlab.py -> /usr/lib/python2.5/site-packages/numpy/oldnumeric copying build/lib.linux-i686-2.5/numpy/oldnumeric/random_array.py -> /usr/lib/python2.5/site-packages/numpy/oldnumeric copying build/lib.linux-i686-2.5/numpy/oldnumeric/ufuncs.py -> /usr/lib/python2.5/site-packages/numpy/oldnumeric copying build/lib.linux-i686-2.5/numpy/oldnumeric/typeconv.py -> /usr/lib/python2.5/site-packages/numpy/oldnumeric copying build/lib.linux-i686-2.5/numpy/oldnumeric/misc.py -> /usr/lib/python2.5/site-packages/numpy/oldnumeric copying build/lib.linux-i686-2.5/numpy/oldnumeric/rng_stats.py -> /usr/lib/python2.5/site-packages/numpy/oldnumeric copying build/lib.linux-i686-2.5/numpy/oldnumeric/rng.py -> /usr/lib/python2.5/site-packages/numpy/oldnumeric copying build/lib.linux-i686-2.5/numpy/oldnumeric/fft.py -> /usr/lib/python2.5/site-packages/numpy/oldnumeric copying build/lib.linux-i686-2.5/numpy/oldnumeric/alter_code2.py -> /usr/lib/python2.5/site-packages/numpy/oldnumeric copying build/lib.linux-i686-2.5/numpy/oldnumeric/array_printer.py -> /usr/lib/python2.5/site-packages/numpy/oldnumeric copying build/lib.linux-i686-2.5/numpy/oldnumeric/setupscons.py -> /usr/lib/python2.5/site-packages/numpy/oldnumeric copying build/lib.linux-i686-2.5/numpy/oldnumeric/ma.py -> /usr/lib/python2.5/site-packages/numpy/oldnumeric copying build/lib.linux-i686-2.5/numpy/oldnumeric/matrix.py -> /usr/lib/python2.5/site-packages/numpy/oldnumeric copying build/lib.linux-i686-2.5/numpy/oldnumeric/alter_code1.py -> /usr/lib/python2.5/site-packages/numpy/oldnumeric copying build/lib.linux-i686-2.5/numpy/oldnumeric/fix_default_axis.py -> /usr/lib/python2.5/site-packages/numpy/oldnumeric copying build/lib.linux-i686-2.5/numpy/oldnumeric/user_array.py -> /usr/lib/python2.5/site-packages/numpy/oldnumeric copying build/lib.linux-i686-2.5/numpy/matlib.py -> /usr/lib/python2.5/site-packages/numpy creating /usr/lib/python2.5/site-packages/numpy/ma copying build/lib.linux-i686-2.5/numpy/ma/version.py -> /usr/lib/python2.5/site-packages/numpy/ma copying build/lib.linux-i686-2.5/numpy/ma/setup.py -> /usr/lib/python2.5/site-packages/numpy/ma copying build/lib.linux-i686-2.5/numpy/ma/__init__.py -> /usr/lib/python2.5/site-packages/numpy/ma copying build/lib.linux-i686-2.5/numpy/ma/core.py -> /usr/lib/python2.5/site-packages/numpy/ma copying build/lib.linux-i686-2.5/numpy/ma/extras.py -> /usr/lib/python2.5/site-packages/numpy/ma copying build/lib.linux-i686-2.5/numpy/ma/testutils.py -> /usr/lib/python2.5/site-packages/numpy/ma copying build/lib.linux-i686-2.5/numpy/ma/mrecords.py -> /usr/lib/python2.5/site-packages/numpy/ma copying build/lib.linux-i686-2.5/numpy/ma/setupscons.py -> /usr/lib/python2.5/site-packages/numpy/ma copying build/lib.linux-i686-2.5/numpy/ma/timer_comparison.py -> /usr/lib/python2.5/site-packages/numpy/ma copying build/lib.linux-i686-2.5/numpy/ma/bench.py -> /usr/lib/python2.5/site-packages/numpy/ma copying build/lib.linux-i686-2.5/numpy/_import_tools.py -> /usr/lib/python2.5/site-packages/numpy copying build/lib.linux-i686-2.5/numpy/setupscons.py -> /usr/lib/python2.5/site-packages/numpy creating /usr/lib/python2.5/site-packages/numpy/fft copying build/lib.linux-i686-2.5/numpy/fft/setup.py -> /usr/lib/python2.5/site-packages/numpy/fft copying build/lib.linux-i686-2.5/numpy/fft/__init__.py -> /usr/lib/python2.5/site-packages/numpy/fft copying build/lib.linux-i686-2.5/numpy/fft/fftpack_lite.so -> /usr/lib/python2.5/site-packages/numpy/fft copying build/lib.linux-i686-2.5/numpy/fft/info.py -> /usr/lib/python2.5/site-packages/numpy/fft copying build/lib.linux-i686-2.5/numpy/fft/fftpack.py -> /usr/lib/python2.5/site-packages/numpy/fft copying build/lib.linux-i686-2.5/numpy/fft/setupscons.py -> /usr/lib/python2.5/site-packages/numpy/fft copying build/lib.linux-i686-2.5/numpy/fft/helper.py -> /usr/lib/python2.5/site-packages/numpy/fft creating /usr/lib/python2.5/site-packages/numpy/linalg copying build/lib.linux-i686-2.5/numpy/linalg/setup.py -> /usr/lib/python2.5/site-packages/numpy/linalg copying build/lib.linux-i686-2.5/numpy/linalg/__init__.py -> /usr/lib/python2.5/site-packages/numpy/linalg copying build/lib.linux-i686-2.5/numpy/linalg/linalg.py -> /usr/lib/python2.5/site-packages/numpy/linalg copying build/lib.linux-i686-2.5/numpy/linalg/info.py -> /usr/lib/python2.5/site-packages/numpy/linalg copying build/lib.linux-i686-2.5/numpy/linalg/setupscons.py -> /usr/lib/python2.5/site-packages/numpy/linalg copying build/lib.linux-i686-2.5/numpy/linalg/lapack_lite.so -> /usr/lib/python2.5/site-packages/numpy/linalg creating /usr/lib/python2.5/site-packages/numpy/doc copying build/lib.linux-i686-2.5/numpy/doc/broadcasting.py -> /usr/lib/python2.5/site-packages/numpy/doc copying build/lib.linux-i686-2.5/numpy/doc/basics.py -> /usr/lib/python2.5/site-packages/numpy/doc copying build/lib.linux-i686-2.5/numpy/doc/internals.py -> /usr/lib/python2.5/site-packages/numpy/doc copying build/lib.linux-i686-2.5/numpy/doc/indexing.py -> /usr/lib/python2.5/site-packages/numpy/doc copying build/lib.linux-i686-2.5/numpy/doc/__init__.py -> /usr/lib/python2.5/site-packages/numpy/doc copying build/lib.linux-i686-2.5/numpy/doc/howtofind.py -> /usr/lib/python2.5/site-packages/numpy/doc copying build/lib.linux-i686-2.5/numpy/doc/subclassing.py -> /usr/lib/python2.5/site-packages/numpy/doc copying build/lib.linux-i686-2.5/numpy/doc/ufuncs.py -> /usr/lib/python2.5/site-packages/numpy/doc copying build/lib.linux-i686-2.5/numpy/doc/misc.py -> /usr/lib/python2.5/site-packages/numpy/doc copying build/lib.linux-i686-2.5/numpy/doc/jargon.py -> /usr/lib/python2.5/site-packages/numpy/doc copying build/lib.linux-i686-2.5/numpy/doc/methods_vs_functions.py -> /usr/lib/python2.5/site-packages/numpy/doc copying build/lib.linux-i686-2.5/numpy/doc/structured_arrays.py -> /usr/lib/python2.5/site-packages/numpy/doc copying build/lib.linux-i686-2.5/numpy/doc/creation.py -> /usr/lib/python2.5/site-packages/numpy/doc copying build/lib.linux-i686-2.5/numpy/doc/performance.py -> /usr/lib/python2.5/site-packages/numpy/doc copying build/lib.linux-i686-2.5/numpy/doc/glossary.py -> /usr/lib/python2.5/site-packages/numpy/doc copying build/lib.linux-i686-2.5/numpy/doc/io.py -> /usr/lib/python2.5/site-packages/numpy/doc creating /usr/lib/python2.5/site-packages/numpy/distutils copying build/lib.linux-i686-2.5/numpy/distutils/misc_util.py -> /usr/lib/python2.5/site-packages/numpy/distutils copying build/lib.linux-i686-2.5/numpy/distutils/conv_template.py -> /usr/lib/python2.5/site-packages/numpy/distutils copying build/lib.linux-i686-2.5/numpy/distutils/setup.py -> /usr/lib/python2.5/site-packages/numpy/distutils copying build/lib.linux-i686-2.5/numpy/distutils/log.py -> /usr/lib/python2.5/site-packages/numpy/distutils copying build/lib.linux-i686-2.5/numpy/distutils/intelccompiler.py -> /usr/lib/python2.5/site-packages/numpy/distutils copying build/lib.linux-i686-2.5/numpy/distutils/__init__.py -> /usr/lib/python2.5/site-packages/numpy/distutils copying build/lib.linux-i686-2.5/numpy/distutils/lib2def.py -> /usr/lib/python2.5/site-packages/numpy/distutils copying build/lib.linux-i686-2.5/numpy/distutils/__version__.py -> /usr/lib/python2.5/site-packages/numpy/distutils copying build/lib.linux-i686-2.5/numpy/distutils/from_template.py -> /usr/lib/python2.5/site-packages/numpy/distutils copying build/lib.linux-i686-2.5/numpy/distutils/exec_command.py -> /usr/lib/python2.5/site-packages/numpy/distutils copying build/lib.linux-i686-2.5/numpy/distutils/core.py -> /usr/lib/python2.5/site-packages/numpy/distutils copying build/lib.linux-i686-2.5/numpy/distutils/interactive.py -> /usr/lib/python2.5/site-packages/numpy/distutils copying build/lib.linux-i686-2.5/numpy/distutils/mingw32ccompiler.py -> /usr/lib/python2.5/site-packages/numpy/distutils copying build/lib.linux-i686-2.5/numpy/distutils/numpy_distribution.py -> /usr/lib/python2.5/site-packages/numpy/distutils copying build/lib.linux-i686-2.5/numpy/distutils/line_endings.py -> /usr/lib/python2.5/site-packages/numpy/distutils copying build/lib.linux-i686-2.5/numpy/distutils/info.py -> /usr/lib/python2.5/site-packages/numpy/distutils copying build/lib.linux-i686-2.5/numpy/distutils/ccompiler.py -> /usr/lib/python2.5/site-packages/numpy/distutils copying build/lib.linux-i686-2.5/numpy/distutils/setupscons.py -> /usr/lib/python2.5/site-packages/numpy/distutils creating /usr/lib/python2.5/site-packages/numpy/distutils/command copying build/lib.linux-i686-2.5/numpy/distutils/command/egg_info.py -> /usr/lib/python2.5/site-packages/numpy/distutils/command copying build/lib.linux-i686-2.5/numpy/distutils/command/install.py -> /usr/lib/python2.5/site-packages/numpy/distutils/command copying build/lib.linux-i686-2.5/numpy/distutils/command/__init__.py -> /usr/lib/python2.5/site-packages/numpy/distutils/command copying build/lib.linux-i686-2.5/numpy/distutils/command/config_compiler.py -> /usr/lib/python2.5/site-packages/numpy/distutils/command copying build/lib.linux-i686-2.5/numpy/distutils/command/build.py -> /usr/lib/python2.5/site-packages/numpy/distutils/command copying build/lib.linux-i686-2.5/numpy/distutils/command/scons.py -> /usr/lib/python2.5/site-packages/numpy/distutils/command copying build/lib.linux-i686-2.5/numpy/distutils/command/build_src.py -> /usr/lib/python2.5/site-packages/numpy/distutils/command copying build/lib.linux-i686-2.5/numpy/distutils/command/build_py.py -> /usr/lib/python2.5/site-packages/numpy/distutils/command copying build/lib.linux-i686-2.5/numpy/distutils/command/build_ext.py -> /usr/lib/python2.5/site-packages/numpy/distutils/command copying build/lib.linux-i686-2.5/numpy/distutils/command/install_data.py -> /usr/lib/python2.5/site-packages/numpy/distutils/command copying build/lib.linux-i686-2.5/numpy/distutils/command/build_scripts.py -> /usr/lib/python2.5/site-packages/numpy/distutils/command copying build/lib.linux-i686-2.5/numpy/distutils/command/develop.py -> /usr/lib/python2.5/site-packages/numpy/distutils/command copying build/lib.linux-i686-2.5/numpy/distutils/command/build_clib.py -> /usr/lib/python2.5/site-packages/numpy/distutils/command copying build/lib.linux-i686-2.5/numpy/distutils/command/config.py -> /usr/lib/python2.5/site-packages/numpy/distutils/command copying build/lib.linux-i686-2.5/numpy/distutils/command/bdist_rpm.py -> /usr/lib/python2.5/site-packages/numpy/distutils/command copying build/lib.linux-i686-2.5/numpy/distutils/command/install_headers.py -> /usr/lib/python2.5/site-packages/numpy/distutils/command copying build/lib.linux-i686-2.5/numpy/distutils/command/sdist.py -> /usr/lib/python2.5/site-packages/numpy/distutils/command copying build/lib.linux-i686-2.5/numpy/distutils/cpuinfo.py -> /usr/lib/python2.5/site-packages/numpy/distutils copying build/lib.linux-i686-2.5/numpy/distutils/unixccompiler.py -> /usr/lib/python2.5/site-packages/numpy/distutils copying build/lib.linux-i686-2.5/numpy/distutils/extension.py -> /usr/lib/python2.5/site-packages/numpy/distutils copying build/lib.linux-i686-2.5/numpy/distutils/__config__.py -> /usr/lib/python2.5/site-packages/numpy/distutils creating /usr/lib/python2.5/site-packages/numpy/distutils/fcompiler copying build/lib.linux-i686-2.5/numpy/distutils/fcompiler/absoft.py -> /usr/lib/python2.5/site-packages/numpy/distutils/fcompiler copying build/lib.linux-i686-2.5/numpy/distutils/fcompiler/mips.py -> /usr/lib/python2.5/site-packages/numpy/distutils/fcompiler copying build/lib.linux-i686-2.5/numpy/distutils/fcompiler/vast.py -> /usr/lib/python2.5/site-packages/numpy/distutils/fcompiler copying build/lib.linux-i686-2.5/numpy/distutils/fcompiler/none.py -> /usr/lib/python2.5/site-packages/numpy/distutils/fcompiler copying build/lib.linux-i686-2.5/numpy/distutils/fcompiler/nag.py -> /usr/lib/python2.5/site-packages/numpy/distutils/fcompiler copying build/lib.linux-i686-2.5/numpy/distutils/fcompiler/lahey.py -> /usr/lib/python2.5/site-packages/numpy/distutils/fcompiler copying build/lib.linux-i686-2.5/numpy/distutils/fcompiler/__init__.py -> /usr/lib/python2.5/site-packages/numpy/distutils/fcompiler copying build/lib.linux-i686-2.5/numpy/distutils/fcompiler/g95.py -> /usr/lib/python2.5/site-packages/numpy/distutils/fcompiler copying build/lib.linux-i686-2.5/numpy/distutils/fcompiler/pg.py -> /usr/lib/python2.5/site-packages/numpy/distutils/fcompiler copying build/lib.linux-i686-2.5/numpy/distutils/fcompiler/ibm.py -> /usr/lib/python2.5/site-packages/numpy/distutils/fcompiler copying build/lib.linux-i686-2.5/numpy/distutils/fcompiler/hpux.py -> /usr/lib/python2.5/site-packages/numpy/distutils/fcompiler copying build/lib.linux-i686-2.5/numpy/distutils/fcompiler/compaq.py -> /usr/lib/python2.5/site-packages/numpy/distutils/fcompiler copying build/lib.linux-i686-2.5/numpy/distutils/fcompiler/intel.py -> /usr/lib/python2.5/site-packages/numpy/distutils/fcompiler copying build/lib.linux-i686-2.5/numpy/distutils/fcompiler/sun.py -> /usr/lib/python2.5/site-packages/numpy/distutils/fcompiler copying build/lib.linux-i686-2.5/numpy/distutils/fcompiler/gnu.py -> /usr/lib/python2.5/site-packages/numpy/distutils/fcompiler copying build/lib.linux-i686-2.5/numpy/distutils/system_info.py -> /usr/lib/python2.5/site-packages/numpy/distutils copying build/lib.linux-i686-2.5/numpy/distutils/environment.py -> /usr/lib/python2.5/site-packages/numpy/distutils creating /usr/lib/python2.5/site-packages/numpy/core copying build/lib.linux-i686-2.5/numpy/core/multiarray.so -> /usr/lib/python2.5/site-packages/numpy/core copying build/lib.linux-i686-2.5/numpy/core/arrayprint.py -> /usr/lib/python2.5/site-packages/numpy/core copying build/lib.linux-i686-2.5/numpy/core/_internal.py -> /usr/lib/python2.5/site-packages/numpy/core copying build/lib.linux-i686-2.5/numpy/core/defchararray.py -> /usr/lib/python2.5/site-packages/numpy/core copying build/lib.linux-i686-2.5/numpy/core/setup.py -> /usr/lib/python2.5/site-packages/numpy/core copying build/lib.linux-i686-2.5/numpy/core/__init__.py -> /usr/lib/python2.5/site-packages/numpy/core copying build/lib.linux-i686-2.5/numpy/core/records.py -> /usr/lib/python2.5/site-packages/numpy/core copying build/lib.linux-i686-2.5/numpy/core/scalarmath.so -> /usr/lib/python2.5/site-packages/numpy/core copying build/lib.linux-i686-2.5/numpy/core/defmatrix.py -> /usr/lib/python2.5/site-packages/numpy/core copying build/lib.linux-i686-2.5/numpy/core/_sort.so -> /usr/lib/python2.5/site-packages/numpy/core copying build/lib.linux-i686-2.5/numpy/core/info.py -> /usr/lib/python2.5/site-packages/numpy/core copying build/lib.linux-i686-2.5/numpy/core/scons_support.py -> /usr/lib/python2.5/site-packages/numpy/core copying build/lib.linux-i686-2.5/numpy/core/__svn_version__.py -> /usr/lib/python2.5/site-packages/numpy/core copying build/lib.linux-i686-2.5/numpy/core/numeric.py -> /usr/lib/python2.5/site-packages/numpy/core copying build/lib.linux-i686-2.5/numpy/core/setupscons.py -> /usr/lib/python2.5/site-packages/numpy/core copying build/lib.linux-i686-2.5/numpy/core/numerictypes.py -> /usr/lib/python2.5/site-packages/numpy/core copying build/lib.linux-i686-2.5/numpy/core/generate_numpy_api.py -> /usr/lib/python2.5/site-packages/numpy/core copying build/lib.linux-i686-2.5/numpy/core/fromnumeric.py -> /usr/lib/python2.5/site-packages/numpy/core copying build/lib.linux-i686-2.5/numpy/core/umath.so -> /usr/lib/python2.5/site-packages/numpy/core copying build/lib.linux-i686-2.5/numpy/core/memmap.py -> /usr/lib/python2.5/site-packages/numpy/core copying build/lib.linux-i686-2.5/numpy/add_newdocs.py -> /usr/lib/python2.5/site-packages/numpy copying build/lib.linux-i686-2.5/numpy/__config__.py -> /usr/lib/python2.5/site-packages/numpy byte-compiling /usr/lib/python2.5/site-packages/numpy/testing/numpytest.py to numpytest.pyc byte-compiling /usr/lib/python2.5/site-packages/numpy/testing/parametric.py to parametric.pyc byte-compiling /usr/lib/python2.5/site-packages/numpy/testing/setup.py to setup.pyc byte-compiling /usr/lib/python2.5/site-packages/numpy/testing/__init__.py to __init__.pyc byte-compiling /usr/lib/python2.5/site-packages/numpy/testing/nosetester.py to nosetester.pyc byte-compiling /usr/lib/python2.5/site-packages/numpy/testing/noseclasses.py to noseclasses.pyc byte-compiling /usr/lib/python2.5/site-packages/numpy/testing/decorators.py to decorators.pyc byte-compiling /usr/lib/python2.5/site-packages/numpy/testing/nulltester.py to nulltester.pyc byte-compiling /usr/lib/python2.5/site-packages/numpy/testing/setupscons.py to setupscons.pyc byte-compiling /usr/lib/python2.5/site-packages/numpy/testing/utils.py to utils.pyc byte-compiling /usr/lib/python2.5/site-packages/numpy/version.py to version.pyc byte-compiling /usr/lib/python2.5/site-packages/numpy/lib/format.py to format.pyc byte-compiling /usr/lib/python2.5/site-packages/numpy/lib/function_base.py to function_base.pyc byte-compiling /usr/lib/python2.5/site-packages/numpy/lib/_datasource.py to _datasource.pyc byte-compiling /usr/lib/python2.5/site-packages/numpy/lib/scimath.py to scimath.pyc byte-compiling /usr/lib/python2.5/site-packages/numpy/lib/type_check.py to type_check.pyc byte-compiling /usr/lib/python2.5/site-packages/numpy/lib/setup.py to setup.pyc byte-compiling /usr/lib/python2.5/site-packages/numpy/lib/index_tricks.py to index_tricks.pyc byte-compiling /usr/lib/python2.5/site-packages/numpy/lib/__init__.py to __init__.pyc byte-compiling /usr/lib/python2.5/site-packages/numpy/lib/twodim_base.py to twodim_base.pyc byte-compiling /usr/lib/python2.5/site-packages/numpy/lib/machar.py to machar.pyc byte-compiling /usr/lib/python2.5/site-packages/numpy/lib/getlimits.py to getlimits.pyc byte-compiling /usr/lib/python2.5/site-packages/numpy/lib/stride_tricks.py to stride_tricks.pyc byte-compiling /usr/lib/python2.5/site-packages/numpy/lib/info.py to info.pyc byte-compiling /usr/lib/python2.5/site-packages/numpy/lib/financial.py to financial.pyc byte-compiling /usr/lib/python2.5/site-packages/numpy/lib/ufunclike.py to ufunclike.pyc byte-compiling /usr/lib/python2.5/site-packages/numpy/lib/setupscons.py to setupscons.pyc byte-compiling /usr/lib/python2.5/site-packages/numpy/lib/io.py to io.pyc byte-compiling /usr/lib/python2.5/site-packages/numpy/lib/shape_base.py to shape_base.pyc byte-compiling /usr/lib/python2.5/site-packages/numpy/lib/utils.py to utils.pyc byte-compiling /usr/lib/python2.5/site-packages/numpy/lib/polynomial.py to polynomial.pyc byte-compiling /usr/lib/python2.5/site-packages/numpy/lib/user_array.py to user_array.pyc byte-compiling /usr/lib/python2.5/site-packages/numpy/lib/arraysetops.py to arraysetops.pyc byte-compiling /usr/lib/python2.5/site-packages/numpy/lib/arrayterator.py to arrayterator.pyc byte-compiling /usr/lib/python2.5/site-packages/numpy/random/setup.py to setup.pyc byte-compiling /usr/lib/python2.5/site-packages/numpy/random/__init__.py to __init__.pyc byte-compiling /usr/lib/python2.5/site-packages/numpy/random/info.py to info.pyc byte-compiling /usr/lib/python2.5/site-packages/numpy/random/setupscons.py to setupscons.pyc byte-compiling /usr/lib/python2.5/site-packages/numpy/ctypeslib.py to ctypeslib.pyc byte-compiling /usr/lib/python2.5/site-packages/numpy/numarray/linear_algebra.py to linear_algebra.pyc byte-compiling /usr/lib/python2.5/site-packages/numpy/numarray/compat.py to compat.pyc byte-compiling /usr/lib/python2.5/site-packages/numpy/numarray/setup.py to setup.pyc byte-compiling /usr/lib/python2.5/site-packages/numpy/numarray/__init__.py to __init__.pyc byte-compiling /usr/lib/python2.5/site-packages/numpy/numarray/functions.py to functions.pyc byte-compiling /usr/lib/python2.5/site-packages/numpy/numarray/mlab.py to mlab.pyc byte-compiling /usr/lib/python2.5/site-packages/numpy/numarray/random_array.py to random_array.pyc byte-compiling /usr/lib/python2.5/site-packages/numpy/numarray/ufuncs.py to ufuncs.pyc byte-compiling /usr/lib/python2.5/site-packages/numpy/numarray/nd_image.py to nd_image.pyc byte-compiling /usr/lib/python2.5/site-packages/numpy/numarray/convolve.py to convolve.pyc byte-compiling /usr/lib/python2.5/site-packages/numpy/numarray/fft.py to fft.pyc byte-compiling /usr/lib/python2.5/site-packages/numpy/numarray/session.py to session.pyc byte-compiling /usr/lib/python2.5/site-packages/numpy/numarray/alter_code2.py to alter_code2.pyc byte-compiling /usr/lib/python2.5/site-packages/numpy/numarray/util.py to util.pyc byte-compiling /usr/lib/python2.5/site-packages/numpy/numarray/setupscons.py to setupscons.pyc byte-compiling /usr/lib/python2.5/site-packages/numpy/numarray/numerictypes.py to numerictypes.pyc byte-compiling /usr/lib/python2.5/site-packages/numpy/numarray/ma.py to ma.pyc byte-compiling /usr/lib/python2.5/site-packages/numpy/numarray/matrix.py to matrix.pyc byte-compiling /usr/lib/python2.5/site-packages/numpy/numarray/alter_code1.py to alter_code1.pyc byte-compiling /usr/lib/python2.5/site-packages/numpy/numarray/image.py to image.pyc byte-compiling /usr/lib/python2.5/site-packages/numpy/setup.py to setup.pyc byte-compiling /usr/lib/python2.5/site-packages/numpy/f2py/f2py2e.py to f2py2e.pyc byte-compiling /usr/lib/python2.5/site-packages/numpy/f2py/f90mod_rules.py to f90mod_rules.pyc byte-compiling /usr/lib/python2.5/site-packages/numpy/f2py/setup.py to setup.pyc byte-compiling /usr/lib/python2.5/site-packages/numpy/f2py/crackfortran.py to crackfortran.pyc byte-compiling /usr/lib/python2.5/site-packages/numpy/f2py/__init__.py to __init__.pyc byte-compiling /usr/lib/python2.5/site-packages/numpy/f2py/rules.py to rules.pyc byte-compiling /usr/lib/python2.5/site-packages/numpy/f2py/use_rules.py to use_rules.pyc byte-compiling /usr/lib/python2.5/site-packages/numpy/f2py/common_rules.py to common_rules.pyc byte-compiling /usr/lib/python2.5/site-packages/numpy/f2py/__version__.py to __version__.pyc byte-compiling /usr/lib/python2.5/site-packages/numpy/f2py/func2subr.py to func2subr.pyc byte-compiling /usr/lib/python2.5/site-packages/numpy/f2py/info.py to info.pyc byte-compiling /usr/lib/python2.5/site-packages/numpy/f2py/__svn_version__.py to __svn_version__.pyc byte-compiling /usr/lib/python2.5/site-packages/numpy/f2py/cb_rules.py to cb_rules.pyc byte-compiling /usr/lib/python2.5/site-packages/numpy/f2py/auxfuncs.py to auxfuncs.pyc byte-compiling /usr/lib/python2.5/site-packages/numpy/f2py/setupscons.py to setupscons.pyc byte-compiling /usr/lib/python2.5/site-packages/numpy/f2py/f2py_testing.py to f2py_testing.pyc byte-compiling /usr/lib/python2.5/site-packages/numpy/f2py/capi_maps.py to capi_maps.pyc byte-compiling /usr/lib/python2.5/site-packages/numpy/f2py/diagnose.py to diagnose.pyc byte-compiling /usr/lib/python2.5/site-packages/numpy/f2py/cfuncs.py to cfuncs.pyc byte-compiling /usr/lib/python2.5/site-packages/numpy/__init__.py to __init__.pyc byte-compiling /usr/lib/python2.5/site-packages/numpy/dual.py to dual.pyc byte-compiling /usr/lib/python2.5/site-packages/numpy/oldnumeric/linear_algebra.py to linear_algebra.pyc byte-compiling /usr/lib/python2.5/site-packages/numpy/oldnumeric/compat.py to compat.pyc byte-compiling /usr/lib/python2.5/site-packages/numpy/oldnumeric/arrayfns.py to arrayfns.pyc byte-compiling /usr/lib/python2.5/site-packages/numpy/oldnumeric/setup.py to setup.pyc byte-compiling /usr/lib/python2.5/site-packages/numpy/oldnumeric/__init__.py to __init__.pyc byte-compiling /usr/lib/python2.5/site-packages/numpy/oldnumeric/precision.py to precision.pyc byte-compiling /usr/lib/python2.5/site-packages/numpy/oldnumeric/functions.py to functions.pyc byte-compiling /usr/lib/python2.5/site-packages/numpy/oldnumeric/mlab.py to mlab.pyc byte-compiling /usr/lib/python2.5/site-packages/numpy/oldnumeric/random_array.py to random_array.pyc byte-compiling /usr/lib/python2.5/site-packages/numpy/oldnumeric/ufuncs.py to ufuncs.pyc byte-compiling /usr/lib/python2.5/site-packages/numpy/oldnumeric/typeconv.py to typeconv.pyc byte-compiling /usr/lib/python2.5/site-packages/numpy/oldnumeric/misc.py to misc.pyc byte-compiling /usr/lib/python2.5/site-packages/numpy/oldnumeric/rng_stats.py to rng_stats.pyc byte-compiling /usr/lib/python2.5/site-packages/numpy/oldnumeric/rng.py to rng.pyc byte-compiling /usr/lib/python2.5/site-packages/numpy/oldnumeric/fft.py to fft.pyc byte-compiling /usr/lib/python2.5/site-packages/numpy/oldnumeric/alter_code2.py to alter_code2.pyc byte-compiling /usr/lib/python2.5/site-packages/numpy/oldnumeric/array_printer.py to array_printer.pyc byte-compiling /usr/lib/python2.5/site-packages/numpy/oldnumeric/setupscons.py to setupscons.pyc byte-compiling /usr/lib/python2.5/site-packages/numpy/oldnumeric/ma.py to ma.pyc byte-compiling /usr/lib/python2.5/site-packages/numpy/oldnumeric/matrix.py to matrix.pyc byte-compiling /usr/lib/python2.5/site-packages/numpy/oldnumeric/alter_code1.py to alter_code1.pyc byte-compiling /usr/lib/python2.5/site-packages/numpy/oldnumeric/fix_default_axis.py to fix_default_axis.pyc byte-compiling /usr/lib/python2.5/site-packages/numpy/oldnumeric/user_array.py to user_array.pyc byte-compiling /usr/lib/python2.5/site-packages/numpy/matlib.py to matlib.pyc byte-compiling /usr/lib/python2.5/site-packages/numpy/ma/version.py to version.pyc byte-compiling /usr/lib/python2.5/site-packages/numpy/ma/setup.py to setup.pyc byte-compiling /usr/lib/python2.5/site-packages/numpy/ma/__init__.py to __init__.pyc byte-compiling /usr/lib/python2.5/site-packages/numpy/ma/core.py to core.pyc byte-compiling /usr/lib/python2.5/site-packages/numpy/ma/extras.py to extras.pyc byte-compiling /usr/lib/python2.5/site-packages/numpy/ma/testutils.py to testutils.pyc byte-compiling /usr/lib/python2.5/site-packages/numpy/ma/mrecords.py to mrecords.pyc byte-compiling /usr/lib/python2.5/site-packages/numpy/ma/setupscons.py to setupscons.pyc byte-compiling /usr/lib/python2.5/site-packages/numpy/ma/timer_comparison.py to timer_comparison.pyc byte-compiling /usr/lib/python2.5/site-packages/numpy/ma/bench.py to bench.pyc byte-compiling /usr/lib/python2.5/site-packages/numpy/_import_tools.py to _import_tools.pyc byte-compiling /usr/lib/python2.5/site-packages/numpy/setupscons.py to setupscons.pyc byte-compiling /usr/lib/python2.5/site-packages/numpy/fft/setup.py to setup.pyc byte-compiling /usr/lib/python2.5/site-packages/numpy/fft/__init__.py to __init__.pyc byte-compiling /usr/lib/python2.5/site-packages/numpy/fft/info.py to info.pyc byte-compiling /usr/lib/python2.5/site-packages/numpy/fft/fftpack.py to fftpack.pyc byte-compiling /usr/lib/python2.5/site-packages/numpy/fft/setupscons.py to setupscons.pyc byte-compiling /usr/lib/python2.5/site-packages/numpy/fft/helper.py to helper.pyc byte-compiling /usr/lib/python2.5/site-packages/numpy/linalg/setup.py to setup.pyc byte-compiling /usr/lib/python2.5/site-packages/numpy/linalg/__init__.py to __init__.pyc byte-compiling /usr/lib/python2.5/site-packages/numpy/linalg/linalg.py to linalg.pyc byte-compiling /usr/lib/python2.5/site-packages/numpy/linalg/info.py to info.pyc byte-compiling /usr/lib/python2.5/site-packages/numpy/linalg/setupscons.py to setupscons.pyc byte-compiling /usr/lib/python2.5/site-packages/numpy/doc/broadcasting.py to broadcasting.pyc byte-compiling /usr/lib/python2.5/site-packages/numpy/doc/basics.py to basics.pyc byte-compiling /usr/lib/python2.5/site-packages/numpy/doc/internals.py to internals.pyc byte-compiling /usr/lib/python2.5/site-packages/numpy/doc/indexing.py to indexing.pyc byte-compiling /usr/lib/python2.5/site-packages/numpy/doc/__init__.py to __init__.pyc byte-compiling /usr/lib/python2.5/site-packages/numpy/doc/howtofind.py to howtofind.pyc byte-compiling /usr/lib/python2.5/site-packages/numpy/doc/subclassing.py to subclassing.pyc byte-compiling /usr/lib/python2.5/site-packages/numpy/doc/ufuncs.py to ufuncs.pyc byte-compiling /usr/lib/python2.5/site-packages/numpy/doc/misc.py to misc.pyc byte-compiling /usr/lib/python2.5/site-packages/numpy/doc/jargon.py to jargon.pyc byte-compiling /usr/lib/python2.5/site-packages/numpy/doc/methods_vs_functions.py to methods_vs_functions.pyc byte-compiling /usr/lib/python2.5/site-packages/numpy/doc/structured_arrays.py to structured_arrays.pyc byte-compiling /usr/lib/python2.5/site-packages/numpy/doc/creation.py to creation.pyc byte-compiling /usr/lib/python2.5/site-packages/numpy/doc/performance.py to performance.pyc byte-compiling /usr/lib/python2.5/site-packages/numpy/doc/glossary.py to glossary.pyc byte-compiling /usr/lib/python2.5/site-packages/numpy/doc/io.py to io.pyc byte-compiling /usr/lib/python2.5/site-packages/numpy/distutils/misc_util.py to misc_util.pyc byte-compiling /usr/lib/python2.5/site-packages/numpy/distutils/conv_template.py to conv_template.pyc byte-compiling /usr/lib/python2.5/site-packages/numpy/distutils/setup.py to setup.pyc byte-compiling /usr/lib/python2.5/site-packages/numpy/distutils/log.py to log.pyc byte-compiling /usr/lib/python2.5/site-packages/numpy/distutils/intelccompiler.py to intelccompiler.pyc byte-compiling /usr/lib/python2.5/site-packages/numpy/distutils/__init__.py to __init__.pyc byte-compiling /usr/lib/python2.5/site-packages/numpy/distutils/lib2def.py to lib2def.pyc byte-compiling /usr/lib/python2.5/site-packages/numpy/distutils/__version__.py to __version__.pyc byte-compiling /usr/lib/python2.5/site-packages/numpy/distutils/from_template.py to from_template.pyc byte-compiling /usr/lib/python2.5/site-packages/numpy/distutils/exec_command.py to exec_command.pyc byte-compiling /usr/lib/python2.5/site-packages/numpy/distutils/core.py to core.pyc byte-compiling /usr/lib/python2.5/site-packages/numpy/distutils/interactive.py to interactive.pyc byte-compiling /usr/lib/python2.5/site-packages/numpy/distutils/mingw32ccompiler.py to mingw32ccompiler.pyc byte-compiling /usr/lib/python2.5/site-packages/numpy/distutils/numpy_distribution.py to numpy_distribution.pyc byte-compiling /usr/lib/python2.5/site-packages/numpy/distutils/line_endings.py to line_endings.pyc byte-compiling /usr/lib/python2.5/site-packages/numpy/distutils/info.py to info.pyc byte-compiling /usr/lib/python2.5/site-packages/numpy/distutils/ccompiler.py to ccompiler.pyc byte-compiling /usr/lib/python2.5/site-packages/numpy/distutils/setupscons.py to setupscons.pyc byte-compiling /usr/lib/python2.5/site-packages/numpy/distutils/command/egg_info.py to egg_info.pyc byte-compiling /usr/lib/python2.5/site-packages/numpy/distutils/command/install.py to install.pyc byte-compiling /usr/lib/python2.5/site-packages/numpy/distutils/command/__init__.py to __init__.pyc byte-compiling /usr/lib/python2.5/site-packages/numpy/distutils/command/config_compiler.py to config_compiler.pyc byte-compiling /usr/lib/python2.5/site-packages/numpy/distutils/command/build.py to build.pyc byte-compiling /usr/lib/python2.5/site-packages/numpy/distutils/command/scons.py to scons.pyc byte-compiling /usr/lib/python2.5/site-packages/numpy/distutils/command/build_src.py to build_src.pyc byte-compiling /usr/lib/python2.5/site-packages/numpy/distutils/command/build_py.py to build_py.pyc byte-compiling /usr/lib/python2.5/site-packages/numpy/distutils/command/build_ext.py to build_ext.pyc byte-compiling /usr/lib/python2.5/site-packages/numpy/distutils/command/install_data.py to install_data.pyc byte-compiling /usr/lib/python2.5/site-packages/numpy/distutils/command/build_scripts.py to build_scripts.pyc byte-compiling /usr/lib/python2.5/site-packages/numpy/distutils/command/develop.py to develop.pyc byte-compiling /usr/lib/python2.5/site-packages/numpy/distutils/command/build_clib.py to build_clib.pyc byte-compiling /usr/lib/python2.5/site-packages/numpy/distutils/command/config.py to config.pyc byte-compiling /usr/lib/python2.5/site-packages/numpy/distutils/command/bdist_rpm.py to bdist_rpm.pyc byte-compiling /usr/lib/python2.5/site-packages/numpy/distutils/command/install_headers.py to install_headers.pyc byte-compiling /usr/lib/python2.5/site-packages/numpy/distutils/command/sdist.py to sdist.pyc byte-compiling /usr/lib/python2.5/site-packages/numpy/distutils/cpuinfo.py to cpuinfo.pyc byte-compiling /usr/lib/python2.5/site-packages/numpy/distutils/unixccompiler.py to unixccompiler.pyc byte-compiling /usr/lib/python2.5/site-packages/numpy/distutils/extension.py to extension.pyc byte-compiling /usr/lib/python2.5/site-packages/numpy/distutils/__config__.py to __config__.pyc byte-compiling /usr/lib/python2.5/site-packages/numpy/distutils/fcompiler/absoft.py to absoft.pyc byte-compiling /usr/lib/python2.5/site-packages/numpy/distutils/fcompiler/mips.py to mips.pyc byte-compiling /usr/lib/python2.5/site-packages/numpy/distutils/fcompiler/vast.py to vast.pyc byte-compiling /usr/lib/python2.5/site-packages/numpy/distutils/fcompiler/none.py to none.pyc byte-compiling /usr/lib/python2.5/site-packages/numpy/distutils/fcompiler/nag.py to nag.pyc byte-compiling /usr/lib/python2.5/site-packages/numpy/distutils/fcompiler/lahey.py to lahey.pyc byte-compiling /usr/lib/python2.5/site-packages/numpy/distutils/fcompiler/__init__.py to __init__.pyc byte-compiling /usr/lib/python2.5/site-packages/numpy/distutils/fcompiler/g95.py to g95.pyc byte-compiling /usr/lib/python2.5/site-packages/numpy/distutils/fcompiler/pg.py to pg.pyc byte-compiling /usr/lib/python2.5/site-packages/numpy/distutils/fcompiler/ibm.py to ibm.pyc byte-compiling /usr/lib/python2.5/site-packages/numpy/distutils/fcompiler/hpux.py to hpux.pyc byte-compiling /usr/lib/python2.5/site-packages/numpy/distutils/fcompiler/compaq.py to compaq.pyc byte-compiling /usr/lib/python2.5/site-packages/numpy/distutils/fcompiler/intel.py to intel.pyc byte-compiling /usr/lib/python2.5/site-packages/numpy/distutils/fcompiler/sun.py to sun.pyc byte-compiling /usr/lib/python2.5/site-packages/numpy/distutils/fcompiler/gnu.py to gnu.pyc byte-compiling /usr/lib/python2.5/site-packages/numpy/distutils/system_info.py to system_info.pyc byte-compiling /usr/lib/python2.5/site-packages/numpy/distutils/environment.py to environment.pyc byte-compiling /usr/lib/python2.5/site-packages/numpy/core/arrayprint.py to arrayprint.pyc byte-compiling /usr/lib/python2.5/site-packages/numpy/core/_internal.py to _internal.pyc byte-compiling /usr/lib/python2.5/site-packages/numpy/core/defchararray.py to defchararray.pyc byte-compiling /usr/lib/python2.5/site-packages/numpy/core/setup.py to setup.pyc byte-compiling /usr/lib/python2.5/site-packages/numpy/core/__init__.py to __init__.pyc byte-compiling /usr/lib/python2.5/site-packages/numpy/core/records.py to records.pyc byte-compiling /usr/lib/python2.5/site-packages/numpy/core/defmatrix.py to defmatrix.pyc byte-compiling /usr/lib/python2.5/site-packages/numpy/core/info.py to info.pyc byte-compiling /usr/lib/python2.5/site-packages/numpy/core/scons_support.py to scons_support.pyc byte-compiling /usr/lib/python2.5/site-packages/numpy/core/__svn_version__.py to __svn_version__.pyc byte-compiling /usr/lib/python2.5/site-packages/numpy/core/numeric.py to numeric.pyc byte-compiling /usr/lib/python2.5/site-packages/numpy/core/setupscons.py to setupscons.pyc byte-compiling /usr/lib/python2.5/site-packages/numpy/core/numerictypes.py to numerictypes.pyc byte-compiling /usr/lib/python2.5/site-packages/numpy/core/generate_numpy_api.py to generate_numpy_api.pyc byte-compiling /usr/lib/python2.5/site-packages/numpy/core/fromnumeric.py to fromnumeric.pyc byte-compiling /usr/lib/python2.5/site-packages/numpy/core/memmap.py to memmap.pyc byte-compiling /usr/lib/python2.5/site-packages/numpy/add_newdocs.py to add_newdocs.pyc byte-compiling /usr/lib/python2.5/site-packages/numpy/__config__.py to __config__.pyc running install_scripts copying build/scripts.linux-i686-2.5/f2py -> /usr/bin changing mode of /usr/bin/f2py to 755 running install_data creating /usr/lib/python2.5/site-packages/numpy/fft/tests copying numpy/fft/tests/test_helper.py -> /usr/lib/python2.5/site-packages/numpy/fft/tests/ copying numpy/fft/tests/test_fftpack.py -> /usr/lib/python2.5/site-packages/numpy/fft/tests/ creating /usr/lib/python2.5/site-packages/numpy/f2py/docs creating /usr/lib/python2.5/site-packages/numpy/f2py/docs/usersguide copying numpy/f2py/docs/usersguide/spam.pyf -> /usr/lib/python2.5/site-packages/numpy/f2py/docs/usersguide copying numpy/f2py/docs/usersguide/array.f -> /usr/lib/python2.5/site-packages/numpy/f2py/docs/usersguide copying numpy/f2py/docs/usersguide/setup_example.py -> /usr/lib/python2.5/site-packages/numpy/f2py/docs/usersguide copying numpy/f2py/docs/usersguide/calculate_session.dat -> /usr/lib/python2.5/site-packages/numpy/f2py/docs/usersguide copying numpy/f2py/docs/usersguide/index.txt -> /usr/lib/python2.5/site-packages/numpy/f2py/docs/usersguide copying numpy/f2py/docs/usersguide/scalar.f -> /usr/lib/python2.5/site-packages/numpy/f2py/docs/usersguide copying numpy/f2py/docs/usersguide/common_session.dat -> /usr/lib/python2.5/site-packages/numpy/f2py/docs/usersguide copying numpy/f2py/docs/usersguide/scalar_session.dat -> /usr/lib/python2.5/site-packages/numpy/f2py/docs/usersguide copying numpy/f2py/docs/usersguide/extcallback_session.dat -> /usr/lib/python2.5/site-packages/numpy/f2py/docs/usersguide copying numpy/f2py/docs/usersguide/fib2.pyf -> /usr/lib/python2.5/site-packages/numpy/f2py/docs/usersguide copying numpy/f2py/docs/usersguide/string.f -> /usr/lib/python2.5/site-packages/numpy/f2py/docs/usersguide copying numpy/f2py/docs/usersguide/ftype_session.dat -> /usr/lib/python2.5/site-packages/numpy/f2py/docs/usersguide copying numpy/f2py/docs/usersguide/callback_session.dat -> /usr/lib/python2.5/site-packages/numpy/f2py/docs/usersguide copying numpy/f2py/docs/usersguide/moddata_session.dat -> /usr/lib/python2.5/site-packages/numpy/f2py/docs/usersguide copying numpy/f2py/docs/usersguide/run_main_session.dat -> /usr/lib/python2.5/site-packages/numpy/f2py/docs/usersguide copying numpy/f2py/docs/usersguide/fib1.pyf -> /usr/lib/python2.5/site-packages/numpy/f2py/docs/usersguide copying numpy/f2py/docs/usersguide/var_session.dat -> /usr/lib/python2.5/site-packages/numpy/f2py/docs/usersguide copying numpy/f2py/docs/usersguide/string_session.dat -> /usr/lib/python2.5/site-packages/numpy/f2py/docs/usersguide copying numpy/f2py/docs/usersguide/var.pyf -> /usr/lib/python2.5/site-packages/numpy/f2py/docs/usersguide copying numpy/f2py/docs/usersguide/array_session.dat -> /usr/lib/python2.5/site-packages/numpy/f2py/docs/usersguide copying numpy/f2py/docs/usersguide/ftype.f -> /usr/lib/python2.5/site-packages/numpy/f2py/docs/usersguide copying numpy/f2py/docs/usersguide/spam_session.dat -> /usr/lib/python2.5/site-packages/numpy/f2py/docs/usersguide copying numpy/f2py/docs/usersguide/moddata.f90 -> /usr/lib/python2.5/site-packages/numpy/f2py/docs/usersguide copying numpy/f2py/docs/usersguide/callback2.pyf -> /usr/lib/python2.5/site-packages/numpy/f2py/docs/usersguide copying numpy/f2py/docs/usersguide/fib1.f -> /usr/lib/python2.5/site-packages/numpy/f2py/docs/usersguide copying numpy/f2py/docs/usersguide/compile_session.dat -> /usr/lib/python2.5/site-packages/numpy/f2py/docs/usersguide copying numpy/f2py/docs/usersguide/docutils.conf -> /usr/lib/python2.5/site-packages/numpy/f2py/docs/usersguide copying numpy/f2py/docs/usersguide/calculate.f -> /usr/lib/python2.5/site-packages/numpy/f2py/docs/usersguide copying numpy/f2py/docs/usersguide/fib3.f -> /usr/lib/python2.5/site-packages/numpy/f2py/docs/usersguide copying numpy/f2py/docs/usersguide/default.css -> /usr/lib/python2.5/site-packages/numpy/f2py/docs/usersguide copying numpy/f2py/docs/usersguide/extcallback.f -> /usr/lib/python2.5/site-packages/numpy/f2py/docs/usersguide copying numpy/f2py/docs/usersguide/common.f -> /usr/lib/python2.5/site-packages/numpy/f2py/docs/usersguide copying numpy/f2py/docs/usersguide/allocarr_session.dat -> /usr/lib/python2.5/site-packages/numpy/f2py/docs/usersguide copying numpy/f2py/docs/usersguide/callback.f -> /usr/lib/python2.5/site-packages/numpy/f2py/docs/usersguide copying numpy/f2py/docs/usersguide/allocarr.f90 -> /usr/lib/python2.5/site-packages/numpy/f2py/docs/usersguide creating /usr/lib/python2.5/site-packages/numpy/f2py/src copying numpy/f2py/src/fortranobject.h -> /usr/lib/python2.5/site-packages/numpy/f2py/src copying numpy/f2py/src/fortranobject.c -> /usr/lib/python2.5/site-packages/numpy/f2py/src creating /usr/lib/python2.5/site-packages/numpy/distutils/tests creating /usr/lib/python2.5/site-packages/numpy/distutils/tests/f2py_f90_ext copying numpy/distutils/tests/f2py_f90_ext/setup.py -> /usr/lib/python2.5/site-packages/numpy/distutils/tests/f2py_f90_ext copying numpy/distutils/tests/f2py_f90_ext/__init__.py -> /usr/lib/python2.5/site-packages/numpy/distutils/tests/f2py_f90_ext creating /usr/lib/python2.5/site-packages/numpy/random/tests copying numpy/random/tests/test_random.py -> /usr/lib/python2.5/site-packages/numpy/random/tests/ creating /usr/lib/python2.5/site-packages/numpy/distutils/tests/swig_ext creating /usr/lib/python2.5/site-packages/numpy/distutils/tests/swig_ext/tests copying numpy/distutils/tests/swig_ext/tests/test_example2.py -> /usr/lib/python2.5/site-packages/numpy/distutils/tests/swig_ext/tests copying numpy/distutils/tests/swig_ext/tests/test_example.py -> /usr/lib/python2.5/site-packages/numpy/distutils/tests/swig_ext/tests creating /usr/lib/python2.5/site-packages/numpy/lib/benchmarks copying numpy/lib/benchmarks/bench_arraysetops.py -> /usr/lib/python2.5/site-packages/numpy/lib/benchmarks/ creating /usr/lib/python2.5/site-packages/numpy/core/tests creating /usr/lib/python2.5/site-packages/numpy/core/tests/data copying numpy/core/tests/data/recarray_from_file.fits -> /usr/lib/python2.5/site-packages/numpy/core/tests/data/ copying numpy/core/tests/data/astype_copy.pkl -> /usr/lib/python2.5/site-packages/numpy/core/tests/data/ copying numpy/random/mtrand/randomkit.h -> /usr/lib/python2.5/site-packages/numpy/random/. creating /usr/lib/python2.5/site-packages/numpy/distutils/tests/pyrex_ext copying numpy/distutils/tests/pyrex_ext/__init__.py -> /usr/lib/python2.5/site-packages/numpy/distutils/tests/pyrex_ext copying numpy/distutils/tests/pyrex_ext/primes.pyx -> /usr/lib/python2.5/site-packages/numpy/distutils/tests/pyrex_ext copying numpy/distutils/tests/pyrex_ext/setup.py -> /usr/lib/python2.5/site-packages/numpy/distutils/tests/pyrex_ext copying numpy/f2py/f2py.1 -> /usr/lib/python2.5/site-packages/numpy/f2py/ creating /usr/lib/python2.5/site-packages/numpy/core/include creating /usr/lib/python2.5/site-packages/numpy/core/include/numpy copying numpy/core/include/numpy/npy_interrupt.h -> /usr/lib/python2.5/site-packages/numpy/core/include/numpy copying numpy/core/include/numpy/ufuncobject.h -> /usr/lib/python2.5/site-packages/numpy/core/include/numpy copying numpy/core/include/numpy/oldnumeric.h -> /usr/lib/python2.5/site-packages/numpy/core/include/numpy copying numpy/core/include/numpy/noprefix.h -> /usr/lib/python2.5/site-packages/numpy/core/include/numpy copying numpy/core/include/numpy/arrayobject.h -> /usr/lib/python2.5/site-packages/numpy/core/include/numpy copying numpy/core/include/numpy/arrayscalars.h -> /usr/lib/python2.5/site-packages/numpy/core/include/numpy copying numpy/core/include/numpy/old_defines.h -> /usr/lib/python2.5/site-packages/numpy/core/include/numpy copying numpy/core/include/numpy/ndarrayobject.h -> /usr/lib/python2.5/site-packages/numpy/core/include/numpy copying numpy/f2py/docs/pytest.py -> /usr/lib/python2.5/site-packages/numpy/f2py/docs/ copying numpy/f2py/docs/OLDNEWS.txt -> /usr/lib/python2.5/site-packages/numpy/f2py/docs/ copying numpy/f2py/docs/TESTING.txt -> /usr/lib/python2.5/site-packages/numpy/f2py/docs/ copying numpy/f2py/docs/simple_session.dat -> /usr/lib/python2.5/site-packages/numpy/f2py/docs/ copying numpy/f2py/docs/simple.f -> /usr/lib/python2.5/site-packages/numpy/f2py/docs/ copying numpy/f2py/docs/hello.f -> /usr/lib/python2.5/site-packages/numpy/f2py/docs/ copying numpy/f2py/docs/THANKS.txt -> /usr/lib/python2.5/site-packages/numpy/f2py/docs/ copying numpy/f2py/docs/pyforttest.pyf -> /usr/lib/python2.5/site-packages/numpy/f2py/docs/ copying numpy/f2py/docs/README.txt -> /usr/lib/python2.5/site-packages/numpy/f2py/docs/ copying numpy/f2py/docs/default.css -> /usr/lib/python2.5/site-packages/numpy/f2py/docs/ copying numpy/f2py/docs/HISTORY.txt -> /usr/lib/python2.5/site-packages/numpy/f2py/docs/ copying numpy/f2py/docs/docutils.conf -> /usr/lib/python2.5/site-packages/numpy/f2py/docs/ copying numpy/f2py/docs/FAQ.txt -> /usr/lib/python2.5/site-packages/numpy/f2py/docs/ copying site.cfg.example -> /usr/lib/python2.5/site-packages/numpy copying INSTALL.txt -> /usr/lib/python2.5/site-packages/numpy copying DEV_README.txt -> /usr/lib/python2.5/site-packages/numpy copying LICENSE.txt -> /usr/lib/python2.5/site-packages/numpy copying COMPATIBILITY -> /usr/lib/python2.5/site-packages/numpy copying README.txt -> /usr/lib/python2.5/site-packages/numpy copying THANKS.txt -> /usr/lib/python2.5/site-packages/numpy creating /usr/lib/python2.5/site-packages/numpy/lib/tests copying numpy/lib/tests/test_twodim_base.py -> /usr/lib/python2.5/site-packages/numpy/lib/tests/ copying numpy/lib/tests/test_regression.py -> /usr/lib/python2.5/site-packages/numpy/lib/tests/ copying numpy/lib/tests/test_polynomial.py -> /usr/lib/python2.5/site-packages/numpy/lib/tests/ copying numpy/lib/tests/test_stride_tricks.py -> /usr/lib/python2.5/site-packages/numpy/lib/tests/ copying numpy/lib/tests/test_index_tricks.py -> /usr/lib/python2.5/site-packages/numpy/lib/tests/ copying numpy/lib/tests/test_financial.py -> /usr/lib/python2.5/site-packages/numpy/lib/tests/ copying numpy/lib/tests/test_machar.py -> /usr/lib/python2.5/site-packages/numpy/lib/tests/ copying numpy/lib/tests/test_function_base.py -> /usr/lib/python2.5/site-packages/numpy/lib/tests/ copying numpy/lib/tests/test_format.py -> /usr/lib/python2.5/site-packages/numpy/lib/tests/ copying numpy/lib/tests/test_io.py -> /usr/lib/python2.5/site-packages/numpy/lib/tests/ copying numpy/lib/tests/test_arraysetops.py -> /usr/lib/python2.5/site-packages/numpy/lib/tests/ copying numpy/lib/tests/test_ufunclike.py -> /usr/lib/python2.5/site-packages/numpy/lib/tests/ copying numpy/lib/tests/test__datasource.py -> /usr/lib/python2.5/site-packages/numpy/lib/tests/ copying numpy/lib/tests/test_getlimits.py -> /usr/lib/python2.5/site-packages/numpy/lib/tests/ copying numpy/lib/tests/test_arrayterator.py -> /usr/lib/python2.5/site-packages/numpy/lib/tests/ copying numpy/lib/tests/test_shape_base.py -> /usr/lib/python2.5/site-packages/numpy/lib/tests/ copying numpy/lib/tests/test_type_check.py -> /usr/lib/python2.5/site-packages/numpy/lib/tests/ copying numpy/distutils/tests/swig_ext/__init__.py -> /usr/lib/python2.5/site-packages/numpy/distutils/tests/swig_ext copying numpy/distutils/tests/swig_ext/setup.py -> /usr/lib/python2.5/site-packages/numpy/distutils/tests/swig_ext creating /usr/lib/python2.5/site-packages/numpy/distutils/tests/swig_ext/src copying numpy/distutils/tests/swig_ext/src/zoo.cc -> /usr/lib/python2.5/site-packages/numpy/distutils/tests/swig_ext/src copying numpy/distutils/tests/swig_ext/src/zoo.i -> /usr/lib/python2.5/site-packages/numpy/distutils/tests/swig_ext/src copying numpy/distutils/tests/swig_ext/src/example.i -> /usr/lib/python2.5/site-packages/numpy/distutils/tests/swig_ext/src copying numpy/distutils/tests/swig_ext/src/zoo.h -> /usr/lib/python2.5/site-packages/numpy/distutils/tests/swig_ext/src copying numpy/distutils/tests/swig_ext/src/example.c -> /usr/lib/python2.5/site-packages/numpy/distutils/tests/swig_ext/src creating /usr/lib/python2.5/site-packages/numpy/tests copying numpy/tests/test_ctypeslib.py -> /usr/lib/python2.5/site-packages/numpy/tests/ creating /usr/lib/python2.5/site-packages/numpy/distutils/tests/pyrex_ext/tests copying numpy/distutils/tests/pyrex_ext/tests/test_primes.py -> /usr/lib/python2.5/site-packages/numpy/distutils/tests/pyrex_ext/tests creating /usr/lib/python2.5/site-packages/numpy/distutils/tests/gen_ext copying numpy/distutils/tests/gen_ext/__init__.py -> /usr/lib/python2.5/site-packages/numpy/distutils/tests/gen_ext copying numpy/distutils/tests/gen_ext/setup.py -> /usr/lib/python2.5/site-packages/numpy/distutils/tests/gen_ext copying numpy/distutils/tests/setup.py -> /usr/lib/python2.5/site-packages/numpy/distutils/tests/ copying numpy/distutils/tests/test_fcompiler_gnu.py -> /usr/lib/python2.5/site-packages/numpy/distutils/tests/ copying numpy/distutils/tests/test_misc_util.py -> /usr/lib/python2.5/site-packages/numpy/distutils/tests/ creating /usr/lib/python2.5/site-packages/numpy/numarray/numpy copying numpy/numarray/numpy/libnumarray.h -> /usr/lib/python2.5/site-packages/numpy/numarray/numpy copying numpy/numarray/numpy/cfunc.h -> /usr/lib/python2.5/site-packages/numpy/numarray/numpy copying numpy/numarray/numpy/numcomplex.h -> /usr/lib/python2.5/site-packages/numpy/numarray/numpy copying numpy/numarray/numpy/ieeespecial.h -> /usr/lib/python2.5/site-packages/numpy/numarray/numpy copying numpy/numarray/numpy/nummacro.h -> /usr/lib/python2.5/site-packages/numpy/numarray/numpy copying numpy/numarray/numpy/arraybase.h -> /usr/lib/python2.5/site-packages/numpy/numarray/numpy creating /usr/lib/python2.5/site-packages/numpy/oldnumeric/tests copying numpy/oldnumeric/tests/test_oldnumeric.py -> /usr/lib/python2.5/site-packages/numpy/oldnumeric/tests/ copying numpy/core/tests/test_ufunc.py -> /usr/lib/python2.5/site-packages/numpy/core/tests/ copying numpy/core/tests/test_regression.py -> /usr/lib/python2.5/site-packages/numpy/core/tests/ copying numpy/core/tests/test_blasdot.py -> /usr/lib/python2.5/site-packages/numpy/core/tests/ copying numpy/core/tests/test_unicode.py -> /usr/lib/python2.5/site-packages/numpy/core/tests/ copying numpy/core/tests/test_scalarmath.py -> /usr/lib/python2.5/site-packages/numpy/core/tests/ copying numpy/core/tests/test_numerictypes.py -> /usr/lib/python2.5/site-packages/numpy/core/tests/ copying numpy/core/tests/test_umath.py -> /usr/lib/python2.5/site-packages/numpy/core/tests/ copying numpy/core/tests/test_print.py -> /usr/lib/python2.5/site-packages/numpy/core/tests/ copying numpy/core/tests/test_records.py -> /usr/lib/python2.5/site-packages/numpy/core/tests/ copying numpy/core/tests/test_numeric.py -> /usr/lib/python2.5/site-packages/numpy/core/tests/ copying numpy/core/tests/test_defmatrix.py -> /usr/lib/python2.5/site-packages/numpy/core/tests/ copying numpy/core/tests/test_defchararray.py -> /usr/lib/python2.5/site-packages/numpy/core/tests/ copying numpy/core/tests/test_multiarray.py -> /usr/lib/python2.5/site-packages/numpy/core/tests/ copying numpy/core/tests/test_memmap.py -> /usr/lib/python2.5/site-packages/numpy/core/tests/ copying numpy/core/tests/test_errstate.py -> /usr/lib/python2.5/site-packages/numpy/core/tests/ creating /usr/lib/python2.5/site-packages/numpy/testing/tests copying numpy/testing/tests/test_utils.py -> /usr/lib/python2.5/site-packages/numpy/testing/tests/ creating /usr/lib/python2.5/site-packages/numpy/ma/tests copying numpy/ma/tests/test_old_ma.py -> /usr/lib/python2.5/site-packages/numpy/ma/tests/ copying numpy/ma/tests/test_core.py -> /usr/lib/python2.5/site-packages/numpy/ma/tests/ copying numpy/ma/tests/test_extras.py -> /usr/lib/python2.5/site-packages/numpy/ma/tests/ copying numpy/ma/tests/test_subclassing.py -> /usr/lib/python2.5/site-packages/numpy/ma/tests/ copying numpy/ma/tests/test_mrecords.py -> /usr/lib/python2.5/site-packages/numpy/ma/tests/ creating /usr/lib/python2.5/site-packages/numpy/distutils/tests/f2py_ext copying numpy/distutils/tests/f2py_ext/setup.py -> /usr/lib/python2.5/site-packages/numpy/distutils/tests/f2py_ext copying numpy/distutils/tests/f2py_ext/__init__.py -> /usr/lib/python2.5/site-packages/numpy/distutils/tests/f2py_ext creating /usr/lib/python2.5/site-packages/numpy/linalg/tests copying numpy/linalg/tests/test_regression.py -> /usr/lib/python2.5/site-packages/numpy/linalg/tests/ copying numpy/linalg/tests/test_linalg.py -> /usr/lib/python2.5/site-packages/numpy/linalg/tests/ creating /usr/lib/python2.5/site-packages/numpy/distutils/tests/gen_ext/tests copying numpy/distutils/tests/gen_ext/tests/test_fib3.py -> /usr/lib/python2.5/site-packages/numpy/distutils/tests/gen_ext/tests creating /usr/lib/python2.5/site-packages/numpy/distutils/tests/f2py_ext/src copying numpy/distutils/tests/f2py_ext/src/fib2.pyf -> /usr/lib/python2.5/site-packages/numpy/distutils/tests/f2py_ext/src copying numpy/distutils/tests/f2py_ext/src/fib1.f -> /usr/lib/python2.5/site-packages/numpy/distutils/tests/f2py_ext/src creating /usr/lib/python2.5/site-packages/numpy/distutils/tests/f2py_f90_ext/include copying numpy/distutils/tests/f2py_f90_ext/include/body.f90 -> /usr/lib/python2.5/site-packages/numpy/distutils/tests/f2py_f90_ext/include creating /usr/lib/python2.5/site-packages/numpy/distutils/tests/f2py_f90_ext/tests copying numpy/distutils/tests/f2py_f90_ext/tests/test_foo.py -> /usr/lib/python2.5/site-packages/numpy/distutils/tests/f2py_f90_ext/tests creating /usr/lib/python2.5/site-packages/numpy/distutils/tests/f2py_ext/tests copying numpy/distutils/tests/f2py_ext/tests/test_fib2.py -> /usr/lib/python2.5/site-packages/numpy/distutils/tests/f2py_ext/tests creating /usr/lib/python2.5/site-packages/numpy/distutils/tests/f2py_f90_ext/src copying numpy/distutils/tests/f2py_f90_ext/src/foo_free.f90 -> /usr/lib/python2.5/site-packages/numpy/distutils/tests/f2py_f90_ext/src copying build/src.linux-i686-2.5/numpy/core/include/numpy/numpyconfig.h -> /usr/lib/python2.5/site-packages/numpy/core/include/numpy copying build/src.linux-i686-2.5/numpy/core/include/numpy/__multiarray_api.h -> /usr/lib/python2.5/site-packages/numpy/core/include/numpy copying build/src.linux-i686-2.5/numpy/core/include/numpy/multiarray_api.txt -> /usr/lib/python2.5/site-packages/numpy/core/include/numpy copying build/src.linux-i686-2.5/numpy/core/include/numpy/__ufunc_api.h -> /usr/lib/python2.5/site-packages/numpy/core/include/numpy copying build/src.linux-i686-2.5/numpy/core/include/numpy/ufunc_api.txt -> /usr/lib/python2.5/site-packages/numpy/core/include/numpy running install_egg_info Writing /usr/lib/python2.5/site-packages/numpy-1.2.1.egg-info
Okay, cool. :) Happy simulating & analyzing! -Matt On Thu, Jan 22, 2009 at 3:00 PM, rsoares <dlleuz@xmission.com> wrote:
It is gfortran.
Also I've tried installing numpy-1.2.1 myself since I notice my version of python is 2.5 and attached the (succesful ?) install log from that. The old yt used python 2.5 but the new one is 2.6. I had to install python-dev however to get my numpy to install.
But what do I do with it? Will it port into the yt-1.5, which is based on python 2.6. How do I do that. Matthew Turk wrote:
Okay, cool. :) Happy simulating & analyzing!
-Matt
On Thu, Jan 22, 2009 at 3:00 PM, rsoares <dlleuz@xmission.com> wrote:
It is gfortran.
Also I've tried installing numpy-1.2.1 myself since I notice my version of python is 2.5 and attached the (succesful ?) install log from that. The old yt used python 2.5 but the new one is 2.6. I had to install python-dev however to get my numpy to install.
_______________________________________________ yt-users mailing list yt-users@lists.spacepope.org http://lists.spacepope.org/listinfo.cgi/yt-users-spacepope.org
Oh! I understand. I apologize. Yes, yt-1.5 (which has not officially been released yet, but I am very pleased you are running on trunk! :) will download and install python2.6 rather than 2.5. Python2.6 has some memory management improvements. However, yt does *not* use anything specific to python2.6 -- you should be just fine running on python2.5. So I would say that if you have numpy and matplotlib installed for python2.5 just go ahead and install the yt subversion trunk: $ python2.5 setup.py install and it should install just fine. As I recall, you previously had a working yt install -- you should be able to install the new version *over* that old version (which is done by using the same python executable as before and calling 'install'), and it should work just peachy. But if that's not the case, let me know? The install_script tries very hard to install an isolated environment; if you install globally, your files may be in /usr/local/lib/python2.5/site-packages/ or /usr/lib/python2.5/site-packages . I wouldn't worry about that for now, though, and instead maybe just give a shot at installing over it? -Matt On Thu, Jan 22, 2009 at 3:08 PM, rsoares <dlleuz@xmission.com> wrote:
But what do I do with it? Will it port into the yt-1.5, which is based on python 2.6. How do I do that.
Matthew Turk wrote:
Okay, cool. :) Happy simulating & analyzing!
-Matt
On Thu, Jan 22, 2009 at 3:00 PM, rsoares <dlleuz@xmission.com> wrote:
It is gfortran.
Also I've tried installing numpy-1.2.1 myself since I notice my version of python is 2.5 and attached the (succesful ?) install log from that. The old yt used python 2.5 but the new one is 2.6. I had to install python-dev however to get my numpy to install.
_______________________________________________ yt-users mailing list yt-users@lists.spacepope.org http://lists.spacepope.org/listinfo.cgi/yt-users-spacepope.org
Actually, now that I think about it, I have a 32-bit ubuntu machine at home, and I can build up a "frozen" directory with precompiled packages and whatnot. I will do that when I get home tonight and put it up on the website. If you end up with a working install, that would probably work out better, but maybe it could be of use to other people as well! -Matt On Thu, Jan 22, 2009 at 3:14 PM, Matthew Turk <matthewturk@gmail.com> wrote:
Oh! I understand. I apologize. Yes, yt-1.5 (which has not officially been released yet, but I am very pleased you are running on trunk! :) will download and install python2.6 rather than 2.5. Python2.6 has some memory management improvements. However, yt does *not* use anything specific to python2.6 -- you should be just fine running on python2.5. So I would say that if you have numpy and matplotlib installed for python2.5 just go ahead and install the yt subversion trunk:
$ python2.5 setup.py install
and it should install just fine. As I recall, you previously had a working yt install -- you should be able to install the new version *over* that old version (which is done by using the same python executable as before and calling 'install'), and it should work just peachy. But if that's not the case, let me know? The install_script tries very hard to install an isolated environment; if you install globally, your files may be in /usr/local/lib/python2.5/site-packages/ or /usr/lib/python2.5/site-packages . I wouldn't worry about that for now, though, and instead maybe just give a shot at installing over it?
-Matt
On Thu, Jan 22, 2009 at 3:08 PM, rsoares <dlleuz@xmission.com> wrote:
But what do I do with it? Will it port into the yt-1.5, which is based on python 2.6. How do I do that.
Matthew Turk wrote:
Okay, cool. :) Happy simulating & analyzing!
-Matt
On Thu, Jan 22, 2009 at 3:00 PM, rsoares <dlleuz@xmission.com> wrote:
It is gfortran.
Also I've tried installing numpy-1.2.1 myself since I notice my version of python is 2.5 and attached the (succesful ?) install log from that. The old yt used python 2.5 but the new one is 2.6. I had to install python-dev however to get my numpy to install.
_______________________________________________ yt-users mailing list yt-users@lists.spacepope.org http://lists.spacepope.org/listinfo.cgi/yt-users-spacepope.org
That's great if you can spare time! Matthew Turk wrote:
Actually, now that I think about it, I have a 32-bit ubuntu machine at home, and I can build up a "frozen" directory with precompiled packages and whatnot. I will do that when I get home tonight and put it up on the website. If you end up with a working install, that would probably work out better, but maybe it could be of use to other people as well!
-Matt
On Thu, Jan 22, 2009 at 3:14 PM, Matthew Turk <matthewturk@gmail.com> wrote:
Oh! I understand. I apologize. Yes, yt-1.5 (which has not officially been released yet, but I am very pleased you are running on trunk! :) will download and install python2.6 rather than 2.5. Python2.6 has some memory management improvements. However, yt does *not* use anything specific to python2.6 -- you should be just fine running on python2.5. So I would say that if you have numpy and matplotlib installed for python2.5 just go ahead and install the yt subversion trunk:
$ python2.5 setup.py install
and it should install just fine. As I recall, you previously had a working yt install -- you should be able to install the new version *over* that old version (which is done by using the same python executable as before and calling 'install'), and it should work just peachy. But if that's not the case, let me know? The install_script tries very hard to install an isolated environment; if you install globally, your files may be in /usr/local/lib/python2.5/site-packages/ or /usr/lib/python2.5/site-packages . I wouldn't worry about that for now, though, and instead maybe just give a shot at installing over it?
-Matt
On Thu, Jan 22, 2009 at 3:08 PM, rsoares <dlleuz@xmission.com> wrote:
But what do I do with it? Will it port into the yt-1.5, which is based on python 2.6. How do I do that.
Matthew Turk wrote:
Okay, cool. :) Happy simulating & analyzing!
-Matt
On Thu, Jan 22, 2009 at 3:00 PM, rsoares <dlleuz@xmission.com> wrote:
It is gfortran.
Also I've tried installing numpy-1.2.1 myself since I notice my version of python is 2.5 and attached the (succesful ?) install log from that. The old yt used python 2.5 but the new one is 2.6. I had to install python-dev however to get my numpy to install.
_______________________________________________ yt-users mailing list yt-users@lists.spacepope.org http://lists.spacepope.org/listinfo.cgi/yt-users-spacepope.org
yt-users mailing list yt-users@lists.spacepope.org http://lists.spacepope.org/listinfo.cgi/yt-users-spacepope.org
Hi, So I had no problem installing yt on my ubuntu box. I'm running 8.10, with recent updates applied, and it's a 32-bit pentium 4 machine from around mid-2004. I'm running gfortran:
[20:52][/opt/yt]$ gfortran --version GNU Fortran (Ubuntu 4.3.2-1ubuntu11) 4.3.2 Copyright (C) 2008 Free Software Foundation, Inc.
GNU Fortran comes with NO WARRANTY, to the extent permitted by law. You may redistribute copies of GNU Fortran under the terms of the GNU General Public License. For more information about these matters, see the file named COPYING << version 4.3.2. Can you tell me which version of gfortran (not g77, which we're trying to avoid using :) you are running? This will be an important datapoint for any future notes I write up about this. I've uploaded my entire (minus source except for yt source) distribution here: http://yt.enzotools.org/files/yt-ubuntu-32bit.zip Unfortunately, it's got some hardcoded paths, so you will at least have to make it *think* that it's in: /opt/yt/ ... so you could either symlink /opt/yt/yt-unknown/ to wherever you unzip it, or you could just unzip it in /opt/yt/ . As for the interactive interpreter, "iyt" is just a front end to ipython. Running "ipython -pylab" and doing the command "from yt.mods import *" will get you the same thing as "iyt". Additionally, running the standard python interpreter puts you into an interactive environment as well, and you can import yt as per usual. I talk about this a little bit in the documentation: http://yt.enzotools.org/doc/quick_guide/index.html All of the commands inside ipython are commands that will work in the standard python interpreter if you run "from yt.mods import *" . Let me know how this goes, Matt
participants (2)
-
Matthew Turk -
rsoares