[New-bugs-announce] [issue11190] test_locale error on AIX

Sébastien Sablé report at bugs.python.org
Fri Feb 11 15:59:01 CET 2011


New submission from Sébastien Sablé <sable at users.sourceforge.net>:

I have the following errors on test_locale on AIX:

======================================================================
FAIL: test_strcoll_with_diacritic (test.test_locale.TestEnUSCollation)
----------------------------------------------------------------------
Traceback (most recent call last):
  File "/san_cis/home/cis/.buildbot/python-aix6/3.x.phenix.xlc/build/Lib/test/test_locale.py", line 364, in test_strcoll_with_diacritic
    self.assertLess(locale.strcoll('à', 'b'), 0)
AssertionError: 1 not less than 0

======================================================================
FAIL: test_strxfrm_with_diacritic (test.test_locale.TestEnUSCollation)
----------------------------------------------------------------------
Traceback (most recent call last):
  File "/san_cis/home/cis/.buildbot/python-aix6/3.x.phenix.xlc/build/Lib/test/test_locale.py", line 367, in test_strxfrm_with_diacritic
    self.assertLess(locale.strxfrm('à'), locale.strxfrm('b'))
AssertionError: '\u01e2\u0100' not less than '\u0164\u0100'

----------------------------------------------------------------------
Ran 35 tests in 0.020s

FAILED (failures=2)

I haven't investigated yet.

----------
messages: 128398
nosy: sable
priority: normal
severity: normal
status: open
title: test_locale error on AIX
versions: Python 3.2

_______________________________________
Python tracker <report at bugs.python.org>
<http://bugs.python.org/issue11190>
_______________________________________


More information about the New-bugs-announce mailing list