[New-bugs-announce] [issue15086] Ubuntu bot: error while loading shared libraries

Stefan Krah report at bugs.python.org
Sat Jun 16 20:18:03 CEST 2012

New submission from Stefan Krah <stefan-usenet at bytereef.org>:

The Ubuntu shared buildbot fails to run the tests:

 using PTY: True
./python: error while loading shared libraries: libpython3.3dm.so.1.0: cannot open shared object file: No such file or directory
make: *** [Python/importlib.h] Error 127

034c814eb187 was O.K., as far as the logs are still visible the error
first appears in 240b7467e65c .

components: Tests
keywords: buildbot
messages: 162981
nosy: skrah
priority: normal
severity: normal
stage: needs patch
status: open
title: Ubuntu bot: error while loading shared libraries
type: behavior
versions: Python 3.3

Python tracker <report at bugs.python.org>

More information about the New-bugs-announce mailing list