[New-bugs-announce] [issue18274] python: not found

William Moreno report at bugs.python.org
Fri Jun 21 03:08:08 CEST 2013

New submission from William Moreno:

mklib: Making FreeBSD static library:  librtasm.a
gmake[4]: Leaving directory `/usr/ports/graphics/libGL/work/Mesa-7.6.1/src/gallium/auxiliary/rtasm'
gmake[4]: Entering directory `/usr/ports/graphics/libGL/work/Mesa-7.6.1/src/gallium/auxiliary/util'
python u_format_access.py u_format.csv > u_format_access.c
python u_format_table.py u_format.csv > u_format_table.c
python: not found
python: not found
gmake[4]: *** No rule to make target `u_format_access.c', needed by `depend'.  Stop.
gmake[4]: Leaving directory `/usr/ports/graphics/libGL/work/Mesa-7.6.1/src/gallium/auxiliary/util'
gmake[3]: *** [default] Error 1
gmake[3]: Leaving directory `/usr/ports/graphics/libGL/work/Mesa-7.6.1/src/gallium/auxiliary'
gmake[2]: *** [default] Error 1
gmake[2]: Leaving directory `/usr/ports/graphics/libGL/work/Mesa-7.6.1/src/gallium'
gmake[1]: *** [subdirs] Error 1
gmake[1]: Leaving directory `/usr/ports/graphics/libGL/work/Mesa-7.6.1/src'
gmake: *** [default] Error 1
*** [do-build] Error code 1

Stop in /usr/ports/graphics/libGL.

components: Build
messages: 191545
nosy: wmoreno3
priority: normal
severity: normal
status: open
title: python: not found
type: compile error
versions: Python 3.3

Python tracker <report at bugs.python.org>

More information about the New-bugs-announce mailing list