<div dir="ltr"><br><div class="gmail_extra"><br><br><div class="gmail_quote">On Thu, Apr 24, 2014 at 5:08 PM,  <span dir="ltr"><<a href="mailto:josef.pktd@gmail.com" target="_blank">josef.pktd@gmail.com</a>></span> wrote:<br>
<blockquote class="gmail_quote" style="margin:0 0 0 .8ex;border-left:1px #ccc solid;padding-left:1ex"><div dir="ltr"><br><div class="gmail_extra"><br><br><div class="gmail_quote"><div><div class="h5">On Thu, Apr 24, 2014 at 7:00 PM, Charles R Harris <span dir="ltr"><<a href="mailto:charlesr.harris@gmail.com" target="_blank">charlesr.harris@gmail.com</a>></span> wrote:<br>

</div></div><blockquote class="gmail_quote" style="margin:0px 0px 0px 0.8ex;border-left-width:1px;border-left-color:rgb(204,204,204);border-left-style:solid;padding-left:1ex"><div><div class="h5"><div dir="ltr"><br><div class="gmail_extra">
Hi Matthew,<br>
</div><div class="gmail_extra"><br><div class="gmail_quote"><div>On Thu, Apr 24, 2014 at 3:56 PM, Matthew Brett <span dir="ltr"><<a href="mailto:matthew.brett@gmail.com" target="_blank">matthew.brett@gmail.com</a>></span> wrote:<br>


<blockquote class="gmail_quote" style="margin:0px 0px 0px 0.8ex;border-left-width:1px;border-left-color:rgb(204,204,204);border-left-style:solid;padding-left:1ex">Hi,<br>
<br>
Thanks to Cark Kleffner's toolchain and some help from Clint Whaley<br>
(main author of ATLAS), I've built 64-bit windows numpy and scipy<br>
wheels for testing.<br>
<br>
The build uses Carl's custom mingw-w64 build with static linking.<br>
<br>
There are two harmless test failures on scipy (being discussed on the<br>
list at the moment) - tests otherwise clean.<br>
<br>
Wheels are here:<br>
<br>
<a href="https://nipy.bic.berkeley.edu/scipy_installers/numpy-1.8.1-cp27-none-win_amd64.whl" target="_blank">https://nipy.bic.berkeley.edu/scipy_installers/numpy-1.8.1-cp27-none-win_amd64.whl</a><br>
<a href="https://nipy.bic.berkeley.edu/scipy_installers/scipy-0.13.3-cp27-none-win_amd64.whl" target="_blank">https://nipy.bic.berkeley.edu/scipy_installers/scipy-0.13.3-cp27-none-win_amd64.whl</a><br>
<br>
You can test with:<br>
<br>
pip install -U pip # to upgrade pip to latest<br>
pip install -f <a href="https://nipy.bic.berkeley.edu/scipy_installers" target="_blank">https://nipy.bic.berkeley.edu/scipy_installers</a> numpy scipy<br>
<br>
Please do send feedback.<br>
<br>
ATLAS binary here:<br>
<br>
<a href="https://nipy.bic.berkeley.edu/scipy_installers/atlas_builds/atlas-64-full-sse2.tar.bz2" target="_blank">https://nipy.bic.berkeley.edu/scipy_installers/atlas_builds/atlas-64-full-sse2.tar.bz2</a><br>
<br>
Many thanks for Carl in particular for doing all the hard work,<br>
<br></blockquote><div><br></div></div><div>Cool. After all these long years... Now all we need is a box running tests for CI.<br><br></div><div>Chuck <br></div></div></div></div>
<br></div></div><div class="">_______________________________________________<br>
NumPy-Discussion mailing list<br>
<a href="mailto:NumPy-Discussion@scipy.org" target="_blank">NumPy-Discussion@scipy.org</a><br>
<a href="http://mail.scipy.org/mailman/listinfo/numpy-discussion" target="_blank">http://mail.scipy.org/mailman/listinfo/numpy-discussion</a><br>
<br></div></blockquote></div><br></div><div class="gmail_extra">I get two test failures with numpy</div><div class="gmail_extra"><br></div><div class="gmail_extra">Josef</div><div class="gmail_extra"><br></div><div class="gmail_extra">

<div class="gmail_extra">>>> np.test()</div><div class="gmail_extra">Running unit tests for numpy</div><div class="gmail_extra">NumPy version 1.8.1</div><div class="gmail_extra">NumPy is installed in C:\Python27\lib\site-packages\numpy</div>

<div class="gmail_extra">Python version 2.7.3 (default, Apr 10 2012, 23:24:47) [MSC v.1500 64 bit (AMD64)]</div><div class="gmail_extra">nose version 1.1.2</div></div><div class="gmail_extra"><br></div><div class="gmail_extra">

<div class="gmail_extra">======================================================================</div><div class="gmail_extra">FAIL: test_iterator.test_iter_broadcasting_errors</div><div class="gmail_extra">----------------------------------------------------------------------</div>

<div class="gmail_extra">Traceback (most recent call last):</div><div class="gmail_extra">  File "C:\Python27\lib\site-packages\nose\case.py", line 197, in runTest</div><div class="gmail_extra">    self.test(*self.arg)</div>

<div class="gmail_extra">  File "C:\Python27\lib\site-packages\numpy\core\tests\test_iterator.py", line 657, in test_iter_broadcasting_errors</div><div class="gmail_extra">    '(2)->(2,newaxis)') % msg)</div>

<div class="gmail_extra">  File "C:\Python27\lib\site-packages\numpy\testing\utils.py", line 44, in assert_</div><div class="gmail_extra">    raise AssertionError(msg)</div><div class="gmail_extra">AssertionError: Message "operands could not be broadcast together with remapped shapes [original->remapped]: (2,3)->(2,3) (2,)->(2,newaxis) and requested shape (4,3)" doesn't contain remapped operand shape(2)->(2,newaxis)</div>

<div class="gmail_extra"><br></div><div class="gmail_extra">======================================================================</div><div class="gmail_extra">FAIL: test_iterator.test_iter_array_cast</div><div class="gmail_extra">

----------------------------------------------------------------------</div><div class="gmail_extra">Traceback (most recent call last):</div><div class="gmail_extra">  File "C:\Python27\lib\site-packages\nose\case.py", line 197, in runTest</div>

<div class="gmail_extra">    self.test(*self.arg)</div><div class="gmail_extra">  File "C:\Python27\lib\site-packages\numpy\core\tests\test_iterator.py", line 836, in test_iter_array_cast</div><div class="gmail_extra">

    assert_equal(i.operands[0].strides, (-96,8,-32))</div><div class="gmail_extra">  File "C:\Python27\lib\site-packages\numpy\testing\utils.py", line 255, in assert_equal</div><div class="gmail_extra">    assert_equal(actual[k], desired[k], 'item=%r\n%s' % (k, err_msg), verbose)</div>

<div class="gmail_extra">  File "C:\Python27\lib\site-packages\numpy\testing\utils.py", line 317, in assert_equal</div><div class="gmail_extra">    raise AssertionError(msg)</div><div class="gmail_extra">AssertionError:</div>

<div class="gmail_extra">Items are not equal:</div><div class="gmail_extra">item=0</div><div class="gmail_extra"><br></div><div class="gmail_extra"> ACTUAL: 96L</div><div class="gmail_extra"> DESIRED: -96</div><div class="gmail_extra">

<br></div><div class="gmail_extra">----------------------------------------------------------------------</div><div class="gmail_extra">Ran 4828 tests in 46.306s</div><div class="gmail_extra"><br></div><div class="gmail_extra">

FAILED (KNOWNFAIL=10, SKIP=8, failures=2)</div><div class="gmail_extra"><nose.result.TextTestResult run=4828 errors=0 failures=2></div><div class="gmail_extra"><br></div></div></div></blockquote><div><br></div><div>
Strange. That second one looks familiar, at least the "-96" part. Wonder why this doesn't show up with the MKL builds.<br><br></div><div>Chuck<br></div></div></div></div>