[pypy-svn] r11745 - pypy/testresult/arigo at tismerysoft.de

arigo at codespeak.net arigo at codespeak.net
Mon May 2 00:18:06 CEST 2005


Author: arigo
Date: Mon May  2 00:18:06 2005
New Revision: 11745

Modified:
   pypy/testresult/arigo at tismerysoft.de/test_hmac.txt
Log:
Passing test.  Good.


Modified: pypy/testresult/arigo at tismerysoft.de/test_hmac.txt
==============================================================================
--- pypy/testresult/arigo at tismerysoft.de/test_hmac.txt	(original)
+++ pypy/testresult/arigo at tismerysoft.de/test_hmac.txt	Mon May  2 00:18:06 2005
@@ -1,14 +1,15 @@
 testreport-version: 1.0
-command: /usr/bin/python /home/arigo/pypysrc/pypy/tool/alarm.py 529 /home/arigo/pypysrc/pypy/interpreter/py.py  /home/arigo/pypysrc/lib-python/2.3.4/test/test_hmac.py
+command: /usr/bin/python /home/arigo/pypysrc/pypy/tool/alarm.py 575 /home/arigo/pypysrc/pypy/interpreter/py.py  /home/arigo/pypysrc/lib-python/2.3.4/test/test_hmac.py
 run by: arigo at tismerysoft.de
 sys.platform: linux2
 sys.version_info: (2, 3, 5, 'final', 0)
 cpu model: AMD Athlon(tm) XP 3000+
 cpu mhz: 2166.513
 oldstyle: no
-pypy-revision: 11706
-startdate: Sun May  1 21:53:26 2005
-timeout: 529.0 seconds
+uselibfile: no
+pypy-revision: 11742
+startdate: Mon May  2 02:00:04 2005
+timeout: 576.0 seconds
 
 ============================================================
 faking <type 'unicode'>
@@ -16,25 +17,7 @@
 faking <type 'file'>
 faking <type 'posix.stat_result'>
 faking <type 'posix.statvfs_result'>
-Traceback (application-level):
-  File "/home/arigo/pypysrc/lib-python/2.3.4/test/test_hmac.py", line 167 in ?
-    test_main()
-  File "/home/arigo/pypysrc/lib-python/2.3.4/test/test_hmac.py", line 163 in test_main
-        CopyTestCase
-  File "/home/arigo/pypysrc/lib-python/2.3.4/test/test_support.py", line 262 in run_unittest
-    run_suite(suite, testclass)
-  File "/home/arigo/pypysrc/lib-python/2.3.4/test/test_support.py", line 247 in run_suite
-        raise TestFailed(err)
-TestFailed: Traceback (most recent call last):
-  File "/home/arigo/pypysrc/lib-python/2.3.4/test/test_hmac.py", line 17, in test_md5_vectors
-    "9294727A3638BB1C13F48EF8158BFC9D")
-  File "/home/arigo/pypysrc/lib-python/2.3.4/test/test_hmac.py", line 13, in md5test
-    self.assertEqual(h.hexdigest().upper(), digest.upper())
-  File "/home/arigo/pypysrc/lib-python/2.3.4/unittest.py", line 302, in failUnlessEqual
-    raise self.failureException, \
-AssertionError: '000000000000000000000000E71DFA9D' != '9294727A3638BB1C13F48EF8158BFC9D'
-
-test_md5_vectors (__main__.TestVectorsTestCase) ... FAIL
+test_md5_vectors (__main__.TestVectorsTestCase) ... ok
 test_sha_vectors (__main__.TestVectorsTestCase) ... ok
 test_normal (__main__.ConstructorTestCase) ... ok
 test_withmodule (__main__.ConstructorTestCase) ... ok
@@ -45,22 +28,10 @@
 test_equality (__main__.CopyTestCase) ... ok
 test_realcopy (__main__.CopyTestCase) ... ok
 
-======================================================================
-FAIL: test_md5_vectors (__main__.TestVectorsTestCase)
-----------------------------------------------------------------------
-Traceback (most recent call last):
-  File "/home/arigo/pypysrc/lib-python/2.3.4/test/test_hmac.py", line 17, in test_md5_vectors
-    "9294727A3638BB1C13F48EF8158BFC9D")
-  File "/home/arigo/pypysrc/lib-python/2.3.4/test/test_hmac.py", line 13, in md5test
-    self.assertEqual(h.hexdigest().upper(), digest.upper())
-  File "/home/arigo/pypysrc/lib-python/2.3.4/unittest.py", line 302, in failUnlessEqual
-    raise self.failureException, \
-AssertionError: '000000000000000000000000E71DFA9D' != '9294727A3638BB1C13F48EF8158BFC9D'
-
 ----------------------------------------------------------------------
-Ran 10 tests in 150.556s
+Ran 10 tests in 217.200s
 
-FAILED (failures=1)
+OK
 ========================== closed ==========================
-execution time: 162.953148842 seconds
-exit status: 1
+execution time: 231.112616062 seconds
+exit status: 0



More information about the Pypy-commit mailing list