[pypy-issue] [issue1642] Numpy fails to load with pypy-2.2-osx64

Tibor Kiss tracker at bugs.pypy.org
Mon Nov 18 17:15:16 CET 2013


Tibor Kiss <tibor.kiss at gmail.com> added the comment:

Attached the build log.

By command line tools you mean xcode?

________________________________________
PyPy bug tracker <tracker at bugs.pypy.org>
<https://bugs.pypy.org/issue1642>
________________________________________
-------------- next part --------------
Running from numpy source directory.
non-existing path in 'numpy/distutils': 'site.cfg'
F2PY Version 2
blas_opt_info:
blas_mkl_info:
  libraries mkl,vml,guide not found in ['/usr/local/lib', '/usr/lib', '/opt/local/lib']
  NOT AVAILABLE

openblas_info:
  libraries openblas not found in ['/usr/local/lib', '/usr/lib', '/opt/local/lib']
  NOT AVAILABLE

atlas_blas_threads_info:
Setting PTATLAS=ATLAS
Setting PTATLAS=ATLAS
customize Gnu95FCompiler
Found executable /usr/local/bin/gfortran
/Users/tiborkiss/devel/workspace/pypy/numpy/numpy/distutils/fcompiler/gnu.py:129: UserWarning: Env. variable MACOSX_DEPLOYMENT_TARGET set to 10.3
  warnings.warn(s)
customize Gnu95FCompiler
customize Gnu95FCompiler using config
compiling '_configtest.c':

/* This file is generated from numpy/distutils/system_info.py */
void ATL_buildinfo(void);
int main(void) {
  ATL_buildinfo();
  return 0;
}

C compiler: cc -arch x86_64 -O2 -fPIC -Wimplicit

compile options: '-c'
cc: _configtest.c
cc -arch x86_64 _configtest.o -L/usr/lib -L/opt/local/lib -latlas -lptf77blas -lptcblas -o _configtest
Undefined symbols for architecture x86_64:
  "_ATL_buildinfo", referenced from:
      _main in _configtest.o
ld: symbol(s) not found for architecture x86_64
clang: error: linker command failed with exit code 1 (use -v to see invocation)
Undefined symbols for architecture x86_64:
  "_ATL_buildinfo", referenced from:
      _main in _configtest.o
ld: symbol(s) not found for architecture x86_64
clang: error: linker command failed with exit code 1 (use -v to see invocation)
failure.
removing: _configtest.c _configtest.o
Status: 255
Output: compiling '_configtest.c':

/* This file is generated from numpy/distutils/system_info.py */
void ATL_buildinfo(void);
int main(void) {
  ATL_buildinfo();
  return 0;
}

C compiler: cc -arch x86_64 -O2 -fPIC -Wimplicit

compile options: '-c'
cc: _configtest.c
cc -arch x86_64 _configtest.o -L/usr/lib -L/opt/local/lib -latlas -lptf77blas -lptcblas -o _configtest
Undefined symbols for architecture x86_64:
  "_ATL_buildinfo", referenced from:
      _main in _configtest.o
ld: symbol(s) not found for architecture x86_64
clang: error: linker command failed with exit code 1 (use -v to see invocation)

Setting PTATLAS=ATLAS
  FOUND:
    libraries = ['atlas', 'ptf77blas', 'ptcblas']
    library_dirs = ['/usr/lib', '/opt/local/lib']
    define_macros = [('ATLAS_INFO', '"\\"None\\""')]
    language = c
    include_dirs = ['/opt/local/include']

  FOUND:
    libraries = ['atlas', 'ptf77blas', 'ptcblas']
    library_dirs = ['/usr/lib', '/opt/local/lib']
    language = c
    define_macros = [('ATLAS_INFO', '"\\"None\\""')]
    include_dirs = ['/opt/local/include']

non-existing path in 'numpy/lib': 'benchmarks'
lapack_opt_info:
lapack_mkl_info:
mkl_info:
  libraries mkl,vml,guide not found in ['/usr/local/lib', '/usr/lib', '/opt/local/lib']
  NOT AVAILABLE

  NOT AVAILABLE

atlas_threads_info:
Setting PTATLAS=ATLAS
  libraries ptf77blas,ptcblas,atlas not found in /usr/local/lib
  libraries lapack_atlas not found in /usr/local/lib
  libraries ptf77blas,ptcblas,atlas not found in /usr/lib
  libraries lapack_atlas not found in /usr/lib
  libraries lapack_atlas not found in /opt/local/lib
numpy.distutils.system_info.atlas_threads_info
Setting PTATLAS=ATLAS
customize Gnu95FCompiler
customize Gnu95FCompiler
customize Gnu95FCompiler using config
compiling '_configtest.c':

/* This file is generated from numpy/distutils/system_info.py */
void ATL_buildinfo(void);
int main(void) {
  ATL_buildinfo();
  return 0;
}

C compiler: cc -arch x86_64 -O2 -fPIC -Wimplicit -O2 -fPIC -Wimplicit

compile options: '-c'
cc: _configtest.c
cc -arch x86_64 _configtest.o -L/opt/local/lib -lptf77blas -lptcblas -latlas -o _configtest
ATLAS version 3.10.0 built by macports on Tue Nov 20 14:53:10 CET 2012:
   UNAME    : Darwin jahbook.local 12.2.0 Darwin Kernel Version 12.2.0: Sat Aug 25 00:48:52 PDT 2012; root:xnu-2050.18.24 1/RELEASE_X86_64 x86_64
   INSTFLG  : -1 0 -a 1 -l 1
   ARCHDEFS : -DATL_OS_OSX -DATL_ARCH_Core2 -DATL_CPUMHZ=2260 -DATL_SSE3 -DATL_SSE2 -DATL_SSE1 -DATL_USE64BITS -DATL_GAS_x8664
   F2CDEFS  : -DAdd_ -DF77_INTEGER=int -DStringSunStyle
   CACHEEDGE: 393216
   F77      : /opt/local/bin/gfortran-mp-4.5, version GNU Fortran (MacPorts gcc45 4.5.4_1) 4.5.4
   F77FLAGS : -O -msse3 -fPIC -m64 -fPIC
   SMC      : /opt/local/bin/gcc-mp-4.5, version gcc-mp-4.5 (MacPorts gcc45 4.5.4_1) 4.5.4
   SMCFLAGS : -fomit-frame-pointer -mfpmath=sse -O2 -msse3 -fPIC -m64 -fPIC
   SKC      : /opt/local/bin/gcc-mp-4.5, version gcc-mp-4.5 (MacPorts gcc45 4.5.4_1) 4.5.4
   SKCFLAGS : -fomit-frame-pointer -mfpmath=sse -O2 -msse3 -fPIC -m64 -fPIC
success!
removing: _configtest.c _configtest.o _configtest
Setting PTATLAS=ATLAS
  FOUND:
    libraries = ['lapack', 'ptf77blas', 'ptcblas', 'atlas']
    library_dirs = ['/opt/local/lib']
    define_macros = [('ATLAS_INFO', '"\\"3.10.0\\""')]
    language = f77
    include_dirs = ['/opt/local/include']

  FOUND:
    libraries = ['lapack', 'ptf77blas', 'ptcblas', 'atlas']
    library_dirs = ['/opt/local/lib']
    language = f77
    define_macros = [('ATLAS_INFO', '"\\"3.10.0\\""')]
    include_dirs = ['/opt/local/include']

/opt/pypy-2.2-osx64/lib-python/2.7/distutils/dist.py:267: UserWarning: Unknown distribution option: 'define_macros'
  warnings.warn(msg)
running build
running config_cc
unifing config_cc, config, build_clib, build_ext, build commands --compiler options
running config_fc
unifing config_fc, config, build_clib, build_ext, build commands --fcompiler options
running build_src
build_src
building py_modules sources
creating build
creating build/src.macosx-10.8-x86_64-2.7
creating build/src.macosx-10.8-x86_64-2.7/numpy
creating build/src.macosx-10.8-x86_64-2.7/numpy/distutils
building library "npymath" sources
customize Gnu95FCompiler
customize Gnu95FCompiler
customize Gnu95FCompiler using config
C compiler: cc -arch x86_64 -O2 -fPIC -Wimplicit -O2 -fPIC -Wimplicit -O2 -fPIC -Wimplicit

compile options: '-Inumpy/core/src/private -Inumpy/core/src -Inumpy/core -Inumpy/core/src/npymath -Inumpy/core/src/multiarray -Inumpy/core/src/umath -Inumpy/core/src/npysort -Inumpy/core/include -I/opt/pypy-2.2-osx64/include -c'
cc: _configtest.c
cc -arch x86_64 _configtest.o -o _configtest
success!
removing: _configtest.c _configtest.o _configtest
C compiler: cc -arch x86_64 -O2 -fPIC -Wimplicit -O2 -fPIC -Wimplicit -O2 -fPIC -Wimplicit

compile options: '-Inumpy/core/src/private -Inumpy/core/src -Inumpy/core -Inumpy/core/src/npymath -Inumpy/core/src/multiarray -Inumpy/core/src/umath -Inumpy/core/src/npysort -Inumpy/core/include -I/opt/pypy-2.2-osx64/include -c'
cc: _configtest.c
_configtest.c:1:5: warning: incompatible redeclaration of library function 'exp'
int exp (void);
    ^
_configtest.c:1:5: note: 'exp' is a builtin with type 'double (double)'
1 warning generated.
cc -arch x86_64 _configtest.o -o _configtest
success!
removing: _configtest.c _configtest.o _configtest
creating build/src.macosx-10.8-x86_64-2.7/numpy/core
creating build/src.macosx-10.8-x86_64-2.7/numpy/core/src
creating build/src.macosx-10.8-x86_64-2.7/numpy/core/src/npymath
conv_template:> build/src.macosx-10.8-x86_64-2.7/numpy/core/src/npymath/npy_math.c
conv_template:> build/src.macosx-10.8-x86_64-2.7/numpy/core/src/npymath/ieee754.c
conv_template:> build/src.macosx-10.8-x86_64-2.7/numpy/core/src/npymath/npy_math_complex.c
building library "npysort" sources
creating build/src.macosx-10.8-x86_64-2.7/numpy/core/src/npysort
conv_template:> build/src.macosx-10.8-x86_64-2.7/numpy/core/src/npysort/quicksort.c
conv_template:> build/src.macosx-10.8-x86_64-2.7/numpy/core/src/npysort/mergesort.c
conv_template:> build/src.macosx-10.8-x86_64-2.7/numpy/core/src/npysort/heapsort.c
conv_template:> build/src.macosx-10.8-x86_64-2.7/numpy/core/src/npysort/selection.c
building extension "numpy.core._dummy" sources
Generating build/src.macosx-10.8-x86_64-2.7/numpy/core/include/numpy/config.h
C compiler: cc -arch x86_64 -O2 -fPIC -Wimplicit -O2 -fPIC -Wimplicit -O2 -fPIC -Wimplicit

compile options: '-Inumpy/core/src/private -Inumpy/core/src -Inumpy/core -Inumpy/core/src/npymath -Inumpy/core/src/multiarray -Inumpy/core/src/umath -Inumpy/core/src/npysort -Inumpy/core/include -I/opt/pypy-2.2-osx64/include -c'
cc: _configtest.c
success!
removing: _configtest.c _configtest.o
C compiler: cc -arch x86_64 -O2 -fPIC -Wimplicit -O2 -fPIC -Wimplicit -O2 -fPIC -Wimplicit

compile options: '-Inumpy/core/src/private -Inumpy/core/src -Inumpy/core -Inumpy/core/src/npymath -Inumpy/core/src/multiarray -Inumpy/core/src/umath -Inumpy/core/src/npysort -Inumpy/core/include -I/opt/pypy-2.2-osx64/include -c'
cc: _configtest.c
_configtest.c:1:10: fatal error: 'endian.h' file not found
#include <endian.h>
         ^
1 error generated.
_configtest.c:1:10: fatal error: 'endian.h' file not found
#include <endian.h>
         ^
1 error generated.
failure.
removing: _configtest.c _configtest.o
C compiler: cc -arch x86_64 -O2 -fPIC -Wimplicit -O2 -fPIC -Wimplicit -O2 -fPIC -Wimplicit

compile options: '-Inumpy/core/src/private -Inumpy/core/src -Inumpy/core -Inumpy/core/src/npymath -Inumpy/core/src/multiarray -Inumpy/core/src/umath -Inumpy/core/src/npysort -Inumpy/core/include -I/opt/pypy-2.2-osx64/include -c'
cc: _configtest.c
success!
removing: _configtest.c _configtest.o
C compiler: cc -arch x86_64 -O2 -fPIC -Wimplicit -O2 -fPIC -Wimplicit -O2 -fPIC -Wimplicit

compile options: '-Inumpy/core/src/private -Inumpy/core/src -Inumpy/core -Inumpy/core/src/npymath -Inumpy/core/src/multiarray -Inumpy/core/src/umath -Inumpy/core/src/npysort -Inumpy/core/include -I/opt/pypy-2.2-osx64/include -c'
cc: _configtest.c
success!
removing: _configtest.c _configtest.o
C compiler: cc -arch x86_64 -O2 -fPIC -Wimplicit -O2 -fPIC -Wimplicit -O2 -fPIC -Wimplicit

compile options: '-Inumpy/core/src/private -Inumpy/core/src -Inumpy/core -Inumpy/core/src/npymath -Inumpy/core/src/multiarray -Inumpy/core/src/umath -Inumpy/core/src/npysort -Inumpy/core/include -I/opt/pypy-2.2-osx64/include -c'
cc: _configtest.c
success!
removing: _configtest.c _configtest.o
C compiler: cc -arch x86_64 -O2 -fPIC -Wimplicit -O2 -fPIC -Wimplicit -O2 -fPIC -Wimplicit

compile options: '-Inumpy/core/src/private -Inumpy/core/src -Inumpy/core -Inumpy/core/src/npymath -Inumpy/core/src/multiarray -Inumpy/core/src/umath -Inumpy/core/src/npysort -Inumpy/core/include -I/opt/pypy-2.2-osx64/include -c'
cc: _configtest.c
_configtest.c:7:12: error: use of undeclared identifier 'SIZEOF_FLOAT'
    (void) SIZEOF_FLOAT;
           ^
1 error generated.
_configtest.c:7:12: error: use of undeclared identifier 'SIZEOF_FLOAT'
    (void) SIZEOF_FLOAT;
           ^
1 error generated.
failure.
removing: _configtest.c _configtest.o
C compiler: cc -arch x86_64 -O2 -fPIC -Wimplicit -O2 -fPIC -Wimplicit -O2 -fPIC -Wimplicit

compile options: '-Inumpy/core/src/private -Inumpy/core/src -Inumpy/core -Inumpy/core/src/npymath -Inumpy/core/src/multiarray -Inumpy/core/src/umath -Inumpy/core/src/npysort -Inumpy/core/include -I/opt/pypy-2.2-osx64/include -c'
cc: _configtest.c
removing: _configtest.c _configtest.o
C compiler: cc -arch x86_64 -O2 -fPIC -Wimplicit -O2 -fPIC -Wimplicit -O2 -fPIC -Wimplicit

compile options: '-Inumpy/core/src/private -Inumpy/core/src -Inumpy/core -Inumpy/core/src/npymath -Inumpy/core/src/multiarray -Inumpy/core/src/umath -Inumpy/core/src/npysort -Inumpy/core/include -I/opt/pypy-2.2-osx64/include -c'
cc: _configtest.c
removing: _configtest.c _configtest.o
C compiler: cc -arch x86_64 -O2 -fPIC -Wimplicit -O2 -fPIC -Wimplicit -O2 -fPIC -Wimplicit

compile options: '-Inumpy/core/src/private -Inumpy/core/src -Inumpy/core -Inumpy/core/src/npymath -Inumpy/core/src/multiarray -Inumpy/core/src/umath -Inumpy/core/src/npysort -Inumpy/core/include -I/opt/pypy-2.2-osx64/include -c'
cc: _configtest.c
removing: _configtest.c _configtest.o
C compiler: cc -arch x86_64 -O2 -fPIC -Wimplicit -O2 -fPIC -Wimplicit -O2 -fPIC -Wimplicit

compile options: '-Inumpy/core/src/private -Inumpy/core/src -Inumpy/core -Inumpy/core/src/npymath -Inumpy/core/src/multiarray -Inumpy/core/src/umath -Inumpy/core/src/npysort -Inumpy/core/include -I/opt/pypy-2.2-osx64/include -c'
cc: _configtest.c
_configtest.c:5:28: error: 'test_array' declared as an array with a negative size
    static int test_array [1 - 2 * !(((long) (sizeof (npy_check_sizeof_type))) == 4)];
                           ^~~~~~~~~~~~~~~~~~~~~~~~~~~~~~~~~~~~~~~~~~~~~~~~~~~~~~~~~
1 error generated.
_configtest.c:5:28: error: 'test_array' declared as an array with a negative size
    static int test_array [1 - 2 * !(((long) (sizeof (npy_check_sizeof_type))) == 4)];
                           ^~~~~~~~~~~~~~~~~~~~~~~~~~~~~~~~~~~~~~~~~~~~~~~~~~~~~~~~~
1 error generated.
C compiler: cc -arch x86_64 -O2 -fPIC -Wimplicit -O2 -fPIC -Wimplicit -O2 -fPIC -Wimplicit

compile options: '-Inumpy/core/src/private -Inumpy/core/src -Inumpy/core -Inumpy/core/src/npymath -Inumpy/core/src/multiarray -Inumpy/core/src/umath -Inumpy/core/src/npysort -Inumpy/core/include -I/opt/pypy-2.2-osx64/include -c'
cc: _configtest.c
_configtest.c:5:28: error: 'test_array' declared as an array with a negative size
    static int test_array [1 - 2 * !(((long) (sizeof (npy_check_sizeof_type))) == 4)];
                           ^~~~~~~~~~~~~~~~~~~~~~~~~~~~~~~~~~~~~~~~~~~~~~~~~~~~~~~~~
1 error generated.
_configtest.c:5:28: error: 'test_array' declared as an array with a negative size
    static int test_array [1 - 2 * !(((long) (sizeof (npy_check_sizeof_type))) == 4)];
                           ^~~~~~~~~~~~~~~~~~~~~~~~~~~~~~~~~~~~~~~~~~~~~~~~~~~~~~~~~
1 error generated.
C compiler: cc -arch x86_64 -O2 -fPIC -Wimplicit -O2 -fPIC -Wimplicit -O2 -fPIC -Wimplicit

compile options: '-Inumpy/core/src/private -Inumpy/core/src -Inumpy/core -Inumpy/core/src/npymath -Inumpy/core/src/multiarray -Inumpy/core/src/umath -Inumpy/core/src/npysort -Inumpy/core/include -I/opt/pypy-2.2-osx64/include -c'
cc: _configtest.c
_configtest.c:5:28: error: 'test_array' declared as an array with a negative size
    static int test_array [1 - 2 * !(((long) (sizeof (npy_check_sizeof_type))) <= 0)];
                           ^~~~~~~~~~~~~~~~~~~~~~~~~~~~~~~~~~~~~~~~~~~~~~~~~~~~~~~~~
1 error generated.
_configtest.c:5:28: error: 'test_array' declared as an array with a negative size
    static int test_array [1 - 2 * !(((long) (sizeof (npy_check_sizeof_type))) <= 0)];
                           ^~~~~~~~~~~~~~~~~~~~~~~~~~~~~~~~~~~~~~~~~~~~~~~~~~~~~~~~~
1 error generated.
C compiler: cc -arch x86_64 -O2 -fPIC -Wimplicit -O2 -fPIC -Wimplicit -O2 -fPIC -Wimplicit

compile options: '-Inumpy/core/src/private -Inumpy/core/src -Inumpy/core -Inumpy/core/src/npymath -Inumpy/core/src/multiarray -Inumpy/core/src/umath -Inumpy/core/src/npysort -Inumpy/core/include -I/opt/pypy-2.2-osx64/include -c'
cc: _configtest.c
_configtest.c:5:28: error: 'test_array' declared as an array with a negative size
    static int test_array [1 - 2 * !(((long) (sizeof (npy_check_sizeof_type))) <= 1)];
                           ^~~~~~~~~~~~~~~~~~~~~~~~~~~~~~~~~~~~~~~~~~~~~~~~~~~~~~~~~
1 error generated.
_configtest.c:5:28: error: 'test_array' declared as an array with a negative size
    static int test_array [1 - 2 * !(((long) (sizeof (npy_check_sizeof_type))) <= 1)];
                           ^~~~~~~~~~~~~~~~~~~~~~~~~~~~~~~~~~~~~~~~~~~~~~~~~~~~~~~~~
1 error generated.
C compiler: cc -arch x86_64 -O2 -fPIC -Wimplicit -O2 -fPIC -Wimplicit -O2 -fPIC -Wimplicit

compile options: '-Inumpy/core/src/private -Inumpy/core/src -Inumpy/core -Inumpy/core/src/npymath -Inumpy/core/src/multiarray -Inumpy/core/src/umath -Inumpy/core/src/npysort -Inumpy/core/include -I/opt/pypy-2.2-osx64/include -c'
cc: _configtest.c
_configtest.c:5:28: error: 'test_array' declared as an array with a negative size
    static int test_array [1 - 2 * !(((long) (sizeof (npy_check_sizeof_type))) <= 3)];
                           ^~~~~~~~~~~~~~~~~~~~~~~~~~~~~~~~~~~~~~~~~~~~~~~~~~~~~~~~~
1 error generated.
_configtest.c:5:28: error: 'test_array' declared as an array with a negative size
    static int test_array [1 - 2 * !(((long) (sizeof (npy_check_sizeof_type))) <= 3)];
                           ^~~~~~~~~~~~~~~~~~~~~~~~~~~~~~~~~~~~~~~~~~~~~~~~~~~~~~~~~
1 error generated.
C compiler: cc -arch x86_64 -O2 -fPIC -Wimplicit -O2 -fPIC -Wimplicit -O2 -fPIC -Wimplicit

compile options: '-Inumpy/core/src/private -Inumpy/core/src -Inumpy/core -Inumpy/core/src/npymath -Inumpy/core/src/multiarray -Inumpy/core/src/umath -Inumpy/core/src/npysort -Inumpy/core/include -I/opt/pypy-2.2-osx64/include -c'
cc: _configtest.c
_configtest.c:5:28: error: 'test_array' declared as an array with a negative size
    static int test_array [1 - 2 * !(((long) (sizeof (npy_check_sizeof_type))) <= 7)];
                           ^~~~~~~~~~~~~~~~~~~~~~~~~~~~~~~~~~~~~~~~~~~~~~~~~~~~~~~~~
1 error generated.
_configtest.c:5:28: error: 'test_array' declared as an array with a negative size
    static int test_array [1 - 2 * !(((long) (sizeof (npy_check_sizeof_type))) <= 7)];
                           ^~~~~~~~~~~~~~~~~~~~~~~~~~~~~~~~~~~~~~~~~~~~~~~~~~~~~~~~~
1 error generated.
C compiler: cc -arch x86_64 -O2 -fPIC -Wimplicit -O2 -fPIC -Wimplicit -O2 -fPIC -Wimplicit

compile options: '-Inumpy/core/src/private -Inumpy/core/src -Inumpy/core -Inumpy/core/src/npymath -Inumpy/core/src/multiarray -Inumpy/core/src/umath -Inumpy/core/src/npysort -Inumpy/core/include -I/opt/pypy-2.2-osx64/include -c'
cc: _configtest.c
removing: _configtest.c _configtest.o _configtest.c _configtest.o _configtest.c _configtest.o _configtest.c _configtest.o _configtest.c _configtest.o _configtest.c _configtest.o _configtest.c _configtest.o
C compiler: cc -arch x86_64 -O2 -fPIC -Wimplicit -O2 -fPIC -Wimplicit -O2 -fPIC -Wimplicit

compile options: '-Inumpy/core/src/private -Inumpy/core/src -Inumpy/core -Inumpy/core/src/npymath -Inumpy/core/src/multiarray -Inumpy/core/src/umath -Inumpy/core/src/npysort -Inumpy/core/include -I/opt/pypy-2.2-osx64/include -c'
cc: _configtest.c
removing: _configtest.c _configtest.o
C compiler: cc -arch x86_64 -O2 -fPIC -Wimplicit -O2 -fPIC -Wimplicit -O2 -fPIC -Wimplicit

compile options: '-Inumpy/core/src/private -Inumpy/core/src -Inumpy/core -Inumpy/core/src/npymath -Inumpy/core/src/multiarray -Inumpy/core/src/umath -Inumpy/core/src/npysort -Inumpy/core/include -I/opt/pypy-2.2-osx64/include -c'
cc: _configtest.c
removing: _configtest.c _configtest.o
C compiler: cc -arch x86_64 -O2 -fPIC -Wimplicit -O2 -fPIC -Wimplicit -O2 -fPIC -Wimplicit

compile options: '-Inumpy/core/src/private -Inumpy/core/src -Inumpy/core -Inumpy/core/src/npymath -Inumpy/core/src/multiarray -Inumpy/core/src/umath -Inumpy/core/src/npysort -Inumpy/core/include -I/opt/pypy-2.2-osx64/include -c'
cc: _configtest.c
removing: _configtest.c _configtest.o
C compiler: cc -arch x86_64 -O2 -fPIC -Wimplicit -O2 -fPIC -Wimplicit -O2 -fPIC -Wimplicit

compile options: '-Inumpy/core/src/private -Inumpy/core/src -Inumpy/core -Inumpy/core/src/npymath -Inumpy/core/src/multiarray -Inumpy/core/src/umath -Inumpy/core/src/npysort -Inumpy/core/include -I/opt/pypy-2.2-osx64/include -c'
cc: _configtest.c
_configtest.c:7:12: error: use of undeclared identifier 'SIZEOF_DOUBLE'
    (void) SIZEOF_DOUBLE;
           ^
1 error generated.
_configtest.c:7:12: error: use of undeclared identifier 'SIZEOF_DOUBLE'
    (void) SIZEOF_DOUBLE;
           ^
1 error generated.
failure.
removing: _configtest.c _configtest.o
C compiler: cc -arch x86_64 -O2 -fPIC -Wimplicit -O2 -fPIC -Wimplicit -O2 -fPIC -Wimplicit

compile options: '-Inumpy/core/src/private -Inumpy/core/src -Inumpy/core -Inumpy/core/src/npymath -Inumpy/core/src/multiarray -Inumpy/core/src/umath -Inumpy/core/src/npysort -Inumpy/core/include -I/opt/pypy-2.2-osx64/include -c'
cc: _configtest.c
removing: _configtest.c _configtest.o
C compiler: cc -arch x86_64 -O2 -fPIC -Wimplicit -O2 -fPIC -Wimplicit -O2 -fPIC -Wimplicit

compile options: '-Inumpy/core/src/private -Inumpy/core/src -Inumpy/core -Inumpy/core/src/npymath -Inumpy/core/src/multiarray -Inumpy/core/src/umath -Inumpy/core/src/npysort -Inumpy/core/include -I/opt/pypy-2.2-osx64/include -c'
cc: _configtest.c
removing: _configtest.c _configtest.o
C compiler: cc -arch x86_64 -O2 -fPIC -Wimplicit -O2 -fPIC -Wimplicit -O2 -fPIC -Wimplicit

compile options: '-Inumpy/core/src/private -Inumpy/core/src -Inumpy/core -Inumpy/core/src/npymath -Inumpy/core/src/multiarray -Inumpy/core/src/umath -Inumpy/core/src/npysort -Inumpy/core/include -I/opt/pypy-2.2-osx64/include -c'
cc: _configtest.c
removing: _configtest.c _configtest.o
C compiler: cc -arch x86_64 -O2 -fPIC -Wimplicit -O2 -fPIC -Wimplicit -O2 -fPIC -Wimplicit

compile options: '-Inumpy/core/src/private -Inumpy/core/src -Inumpy/core -Inumpy/core/src/npymath -Inumpy/core/src/multiarray -Inumpy/core/src/umath -Inumpy/core/src/npysort -Inumpy/core/include -I/opt/pypy-2.2-osx64/include -c'
cc: _configtest.c
_configtest.c:5:28: error: 'test_array' declared as an array with a negative size
    static int test_array [1 - 2 * !(((long) (sizeof (npy_check_sizeof_type))) == 8)];
                           ^~~~~~~~~~~~~~~~~~~~~~~~~~~~~~~~~~~~~~~~~~~~~~~~~~~~~~~~~
1 error generated.
_configtest.c:5:28: error: 'test_array' declared as an array with a negative size
    static int test_array [1 - 2 * !(((long) (sizeof (npy_check_sizeof_type))) == 8)];
                           ^~~~~~~~~~~~~~~~~~~~~~~~~~~~~~~~~~~~~~~~~~~~~~~~~~~~~~~~~
1 error generated.
C compiler: cc -arch x86_64 -O2 -fPIC -Wimplicit -O2 -fPIC -Wimplicit -O2 -fPIC -Wimplicit

compile options: '-Inumpy/core/src/private -Inumpy/core/src -Inumpy/core -Inumpy/core/src/npymath -Inumpy/core/src/multiarray -Inumpy/core/src/umath -Inumpy/core/src/npysort -Inumpy/core/include -I/opt/pypy-2.2-osx64/include -c'
cc: _configtest.c
_configtest.c:5:28: error: 'test_array' declared as an array with a negative size
    static int test_array [1 - 2 * !(((long) (sizeof (npy_check_sizeof_type))) == 8)];
                           ^~~~~~~~~~~~~~~~~~~~~~~~~~~~~~~~~~~~~~~~~~~~~~~~~~~~~~~~~
1 error generated.
_configtest.c:5:28: error: 'test_array' declared as an array with a negative size
    static int test_array [1 - 2 * !(((long) (sizeof (npy_check_sizeof_type))) == 8)];
                           ^~~~~~~~~~~~~~~~~~~~~~~~~~~~~~~~~~~~~~~~~~~~~~~~~~~~~~~~~
1 error generated.
C compiler: cc -arch x86_64 -O2 -fPIC -Wimplicit -O2 -fPIC -Wimplicit -O2 -fPIC -Wimplicit

compile options: '-Inumpy/core/src/private -Inumpy/core/src -Inumpy/core -Inumpy/core/src/npymath -Inumpy/core/src/multiarray -Inumpy/core/src/umath -Inumpy/core/src/npysort -Inumpy/core/include -I/opt/pypy-2.2-osx64/include -c'
cc: _configtest.c
_configtest.c:5:28: error: 'test_array' declared as an array with a negative size
    static int test_array [1 - 2 * !(((long) (sizeof (npy_check_sizeof_type))) <= 0)];
                           ^~~~~~~~~~~~~~~~~~~~~~~~~~~~~~~~~~~~~~~~~~~~~~~~~~~~~~~~~
1 error generated.
_configtest.c:5:28: error: 'test_array' declared as an array with a negative size
    static int test_array [1 - 2 * !(((long) (sizeof (npy_check_sizeof_type))) <= 0)];
                           ^~~~~~~~~~~~~~~~~~~~~~~~~~~~~~~~~~~~~~~~~~~~~~~~~~~~~~~~~
1 error generated.
C compiler: cc -arch x86_64 -O2 -fPIC -Wimplicit -O2 -fPIC -Wimplicit -O2 -fPIC -Wimplicit

compile options: '-Inumpy/core/src/private -Inumpy/core/src -Inumpy/core -Inumpy/core/src/npymath -Inumpy/core/src/multiarray -Inumpy/core/src/umath -Inumpy/core/src/npysort -Inumpy/core/include -I/opt/pypy-2.2-osx64/include -c'
cc: _configtest.c
_configtest.c:5:28: error: 'test_array' declared as an array with a negative size
    static int test_array [1 - 2 * !(((long) (sizeof (npy_check_sizeof_type))) <= 1)];
                           ^~~~~~~~~~~~~~~~~~~~~~~~~~~~~~~~~~~~~~~~~~~~~~~~~~~~~~~~~
1 error generated.
_configtest.c:5:28: error: 'test_array' declared as an array with a negative size
    static int test_array [1 - 2 * !(((long) (sizeof (npy_check_sizeof_type))) <= 1)];
                           ^~~~~~~~~~~~~~~~~~~~~~~~~~~~~~~~~~~~~~~~~~~~~~~~~~~~~~~~~
1 error generated.
C compiler: cc -arch x86_64 -O2 -fPIC -Wimplicit -O2 -fPIC -Wimplicit -O2 -fPIC -Wimplicit

compile options: '-Inumpy/core/src/private -Inumpy/core/src -Inumpy/core -Inumpy/core/src/npymath -Inumpy/core/src/multiarray -Inumpy/core/src/umath -Inumpy/core/src/npysort -Inumpy/core/include -I/opt/pypy-2.2-osx64/include -c'
cc: _configtest.c
_configtest.c:5:28: error: 'test_array' declared as an array with a negative size
    static int test_array [1 - 2 * !(((long) (sizeof (npy_check_sizeof_type))) <= 3)];
                           ^~~~~~~~~~~~~~~~~~~~~~~~~~~~~~~~~~~~~~~~~~~~~~~~~~~~~~~~~
1 error generated.
_configtest.c:5:28: error: 'test_array' declared as an array with a negative size
    static int test_array [1 - 2 * !(((long) (sizeof (npy_check_sizeof_type))) <= 3)];
                           ^~~~~~~~~~~~~~~~~~~~~~~~~~~~~~~~~~~~~~~~~~~~~~~~~~~~~~~~~
1 error generated.
C compiler: cc -arch x86_64 -O2 -fPIC -Wimplicit -O2 -fPIC -Wimplicit -O2 -fPIC -Wimplicit

compile options: '-Inumpy/core/src/private -Inumpy/core/src -Inumpy/core -Inumpy/core/src/npymath -Inumpy/core/src/multiarray -Inumpy/core/src/umath -Inumpy/core/src/npysort -Inumpy/core/include -I/opt/pypy-2.2-osx64/include -c'
cc: _configtest.c
_configtest.c:5:28: error: 'test_array' declared as an array with a negative size
    static int test_array [1 - 2 * !(((long) (sizeof (npy_check_sizeof_type))) <= 7)];
                           ^~~~~~~~~~~~~~~~~~~~~~~~~~~~~~~~~~~~~~~~~~~~~~~~~~~~~~~~~
1 error generated.
_configtest.c:5:28: error: 'test_array' declared as an array with a negative size
    static int test_array [1 - 2 * !(((long) (sizeof (npy_check_sizeof_type))) <= 7)];
                           ^~~~~~~~~~~~~~~~~~~~~~~~~~~~~~~~~~~~~~~~~~~~~~~~~~~~~~~~~
1 error generated.
C compiler: cc -arch x86_64 -O2 -fPIC -Wimplicit -O2 -fPIC -Wimplicit -O2 -fPIC -Wimplicit

compile options: '-Inumpy/core/src/private -Inumpy/core/src -Inumpy/core -Inumpy/core/src/npymath -Inumpy/core/src/multiarray -Inumpy/core/src/umath -Inumpy/core/src/npysort -Inumpy/core/include -I/opt/pypy-2.2-osx64/include -c'
cc: _configtest.c
_configtest.c:5:28: error: 'test_array' declared as an array with a negative size
    static int test_array [1 - 2 * !(((long) (sizeof (npy_check_sizeof_type))) <= 15)];
                           ^~~~~~~~~~~~~~~~~~~~~~~~~~~~~~~~~~~~~~~~~~~~~~~~~~~~~~~~~~
1 error generated.
_configtest.c:5:28: error: 'test_array' declared as an array with a negative size
    static int test_array [1 - 2 * !(((long) (sizeof (npy_check_sizeof_type))) <= 15)];
                           ^~~~~~~~~~~~~~~~~~~~~~~~~~~~~~~~~~~~~~~~~~~~~~~~~~~~~~~~~~
1 error generated.
C compiler: cc -arch x86_64 -O2 -fPIC -Wimplicit -O2 -fPIC -Wimplicit -O2 -fPIC -Wimplicit

compile options: '-Inumpy/core/src/private -Inumpy/core/src -Inumpy/core -Inumpy/core/src/npymath -Inumpy/core/src/multiarray -Inumpy/core/src/umath -Inumpy/core/src/npysort -Inumpy/core/include -I/opt/pypy-2.2-osx64/include -c'
cc: _configtest.c
removing: _configtest.c _configtest.o _configtest.c _configtest.o _configtest.c _configtest.o _configtest.c _configtest.o _configtest.c _configtest.o _configtest.c _configtest.o _configtest.c _configtest.o _configtest.c _configtest.o
C compiler: cc -arch x86_64 -O2 -fPIC -Wimplicit -O2 -fPIC -Wimplicit -O2 -fPIC -Wimplicit

compile options: '-Inumpy/core/src/private -Inumpy/core/src -Inumpy/core -Inumpy/core/src/npymath -Inumpy/core/src/multiarray -Inumpy/core/src/umath -Inumpy/core/src/npysort -Inumpy/core/include -I/opt/pypy-2.2-osx64/include -c'
cc: _configtest.c
removing: _configtest.c _configtest.o
C compiler: cc -arch x86_64 -O2 -fPIC -Wimplicit -O2 -fPIC -Wimplicit -O2 -fPIC -Wimplicit

compile options: '-Inumpy/core/src/private -Inumpy/core/src -Inumpy/core -Inumpy/core/src/npymath -Inumpy/core/src/multiarray -Inumpy/core/src/umath -Inumpy/core/src/npysort -Inumpy/core/include -I/opt/pypy-2.2-osx64/include -c'
cc: _configtest.c
removing: _configtest.c _configtest.o
C compiler: cc -arch x86_64 -O2 -fPIC -Wimplicit -O2 -fPIC -Wimplicit -O2 -fPIC -Wimplicit

compile options: '-Inumpy/core/src/private -Inumpy/core/src -Inumpy/core -Inumpy/core/src/npymath -Inumpy/core/src/multiarray -Inumpy/core/src/umath -Inumpy/core/src/npysort -Inumpy/core/include -I/opt/pypy-2.2-osx64/include -c'
cc: _configtest.c
removing: _configtest.c _configtest.o
C compiler: cc -arch x86_64 -O2 -fPIC -Wimplicit -O2 -fPIC -Wimplicit -O2 -fPIC -Wimplicit

compile options: '-Inumpy/core/src/private -Inumpy/core/src -Inumpy/core -Inumpy/core/src/npymath -Inumpy/core/src/multiarray -Inumpy/core/src/umath -Inumpy/core/src/npysort -Inumpy/core/include -I/opt/pypy-2.2-osx64/include -c'
cc: _configtest.c
removing: _configtest.c _configtest.o
C compiler: cc -arch x86_64 -O2 -fPIC -Wimplicit -O2 -fPIC -Wimplicit -O2 -fPIC -Wimplicit

compile options: '-Inumpy/core/src/private -Inumpy/core/src -Inumpy/core -Inumpy/core/src/npymath -Inumpy/core/src/multiarray -Inumpy/core/src/umath -Inumpy/core/src/npysort -Inumpy/core/include -I/opt/pypy-2.2-osx64/include -c'
cc: _configtest.c
_configtest.c:7:12: error: use of undeclared identifier 'SIZEOF_LONGDOUBLE'
    (void) SIZEOF_LONGDOUBLE;
           ^
1 error generated.
_configtest.c:7:12: error: use of undeclared identifier 'SIZEOF_LONGDOUBLE'
    (void) SIZEOF_LONGDOUBLE;
           ^
1 error generated.
failure.
removing: _configtest.c _configtest.o
C compiler: cc -arch x86_64 -O2 -fPIC -Wimplicit -O2 -fPIC -Wimplicit -O2 -fPIC -Wimplicit

compile options: '-Inumpy/core/src/private -Inumpy/core/src -Inumpy/core -Inumpy/core/src/npymath -Inumpy/core/src/multiarray -Inumpy/core/src/umath -Inumpy/core/src/npysort -Inumpy/core/include -I/opt/pypy-2.2-osx64/include -c'
cc: _configtest.c
removing: _configtest.c _configtest.o
C compiler: cc -arch x86_64 -O2 -fPIC -Wimplicit -O2 -fPIC -Wimplicit -O2 -fPIC -Wimplicit

compile options: '-Inumpy/core/src/private -Inumpy/core/src -Inumpy/core -Inumpy/core/src/npymath -Inumpy/core/src/multiarray -Inumpy/core/src/umath -Inumpy/core/src/npysort -Inumpy/core/include -I/opt/pypy-2.2-osx64/include -c'
cc: _configtest.c
_configtest.c:5:28: error: 'test_array' declared as an array with a negative size
    static int test_array [1 - 2 * !(((long) (sizeof (npy_check_sizeof_type))) == 8)];
                           ^~~~~~~~~~~~~~~~~~~~~~~~~~~~~~~~~~~~~~~~~~~~~~~~~~~~~~~~~
1 error generated.
_configtest.c:5:28: error: 'test_array' declared as an array with a negative size
    static int test_array [1 - 2 * !(((long) (sizeof (npy_check_sizeof_type))) == 8)];
                           ^~~~~~~~~~~~~~~~~~~~~~~~~~~~~~~~~~~~~~~~~~~~~~~~~~~~~~~~~
1 error generated.
C compiler: cc -arch x86_64 -O2 -fPIC -Wimplicit -O2 -fPIC -Wimplicit -O2 -fPIC -Wimplicit

compile options: '-Inumpy/core/src/private -Inumpy/core/src -Inumpy/core -Inumpy/core/src/npymath -Inumpy/core/src/multiarray -Inumpy/core/src/umath -Inumpy/core/src/npysort -Inumpy/core/include -I/opt/pypy-2.2-osx64/include -c'
cc: _configtest.c
_configtest.c:5:28: error: 'test_array' declared as an array with a negative size
    static int test_array [1 - 2 * !(((long) (sizeof (npy_check_sizeof_type))) == 12)];
                           ^~~~~~~~~~~~~~~~~~~~~~~~~~~~~~~~~~~~~~~~~~~~~~~~~~~~~~~~~~
1 error generated.
_configtest.c:5:28: error: 'test_array' declared as an array with a negative size
    static int test_array [1 - 2 * !(((long) (sizeof (npy_check_sizeof_type))) == 12)];
                           ^~~~~~~~~~~~~~~~~~~~~~~~~~~~~~~~~~~~~~~~~~~~~~~~~~~~~~~~~~
1 error generated.
C compiler: cc -arch x86_64 -O2 -fPIC -Wimplicit -O2 -fPIC -Wimplicit -O2 -fPIC -Wimplicit

compile options: '-Inumpy/core/src/private -Inumpy/core/src -Inumpy/core -Inumpy/core/src/npymath -Inumpy/core/src/multiarray -Inumpy/core/src/umath -Inumpy/core/src/npysort -Inumpy/core/include -I/opt/pypy-2.2-osx64/include -c'
cc: _configtest.c
removing: _configtest.c _configtest.o _configtest.c _configtest.o _configtest.c _configtest.o
C compiler: cc -arch x86_64 -O2 -fPIC -Wimplicit -O2 -fPIC -Wimplicit -O2 -fPIC -Wimplicit

compile options: '-Inumpy/core/src/private -Inumpy/core/src -Inumpy/core -Inumpy/core/src/npymath -Inumpy/core/src/multiarray -Inumpy/core/src/umath -Inumpy/core/src/npysort -Inumpy/core/include -I/opt/pypy-2.2-osx64/include -c'
cc: _configtest.c
removing: _configtest.c _configtest.o
C compiler: cc -arch x86_64 -O2 -fPIC -Wimplicit -O2 -fPIC -Wimplicit -O2 -fPIC -Wimplicit

compile options: '-Inumpy/core/src/private -Inumpy/core/src -Inumpy/core -Inumpy/core/src/npymath -Inumpy/core/src/multiarray -Inumpy/core/src/umath -Inumpy/core/src/npysort -Inumpy/core/include -I/opt/pypy-2.2-osx64/include -c'
cc: _configtest.c
_configtest.c:5:28: error: 'test_array' declared as an array with a negative size
    static int test_array [1 - 2 * !(((long) (sizeof (npy_check_sizeof_type))) == 8)];
                           ^~~~~~~~~~~~~~~~~~~~~~~~~~~~~~~~~~~~~~~~~~~~~~~~~~~~~~~~~
1 error generated.
_configtest.c:5:28: error: 'test_array' declared as an array with a negative size
    static int test_array [1 - 2 * !(((long) (sizeof (npy_check_sizeof_type))) == 8)];
                           ^~~~~~~~~~~~~~~~~~~~~~~~~~~~~~~~~~~~~~~~~~~~~~~~~~~~~~~~~
1 error generated.
C compiler: cc -arch x86_64 -O2 -fPIC -Wimplicit -O2 -fPIC -Wimplicit -O2 -fPIC -Wimplicit

compile options: '-Inumpy/core/src/private -Inumpy/core/src -Inumpy/core -Inumpy/core/src/npymath -Inumpy/core/src/multiarray -Inumpy/core/src/umath -Inumpy/core/src/npysort -Inumpy/core/include -I/opt/pypy-2.2-osx64/include -c'
cc: _configtest.c
_configtest.c:5:28: error: 'test_array' declared as an array with a negative size
    static int test_array [1 - 2 * !(((long) (sizeof (npy_check_sizeof_type))) == 12)];
                           ^~~~~~~~~~~~~~~~~~~~~~~~~~~~~~~~~~~~~~~~~~~~~~~~~~~~~~~~~~
1 error generated.
_configtest.c:5:28: error: 'test_array' declared as an array with a negative size
    static int test_array [1 - 2 * !(((long) (sizeof (npy_check_sizeof_type))) == 12)];
                           ^~~~~~~~~~~~~~~~~~~~~~~~~~~~~~~~~~~~~~~~~~~~~~~~~~~~~~~~~~
1 error generated.
C compiler: cc -arch x86_64 -O2 -fPIC -Wimplicit -O2 -fPIC -Wimplicit -O2 -fPIC -Wimplicit

compile options: '-Inumpy/core/src/private -Inumpy/core/src -Inumpy/core -Inumpy/core/src/npymath -Inumpy/core/src/multiarray -Inumpy/core/src/umath -Inumpy/core/src/npysort -Inumpy/core/include -I/opt/pypy-2.2-osx64/include -c'
cc: _configtest.c
_configtest.c:5:28: error: 'test_array' declared as an array with a negative size
    static int test_array [1 - 2 * !(((long) (sizeof (npy_check_sizeof_type))) == 16)];
                           ^~~~~~~~~~~~~~~~~~~~~~~~~~~~~~~~~~~~~~~~~~~~~~~~~~~~~~~~~~
1 error generated.
_configtest.c:5:28: error: 'test_array' declared as an array with a negative size
    static int test_array [1 - 2 * !(((long) (sizeof (npy_check_sizeof_type))) == 16)];
                           ^~~~~~~~~~~~~~~~~~~~~~~~~~~~~~~~~~~~~~~~~~~~~~~~~~~~~~~~~~
1 error generated.
C compiler: cc -arch x86_64 -O2 -fPIC -Wimplicit -O2 -fPIC -Wimplicit -O2 -fPIC -Wimplicit

compile options: '-Inumpy/core/src/private -Inumpy/core/src -Inumpy/core -Inumpy/core/src/npymath -Inumpy/core/src/multiarray -Inumpy/core/src/umath -Inumpy/core/src/npysort -Inumpy/core/include -I/opt/pypy-2.2-osx64/include -c'
cc: _configtest.c
_configtest.c:5:28: error: 'test_array' declared as an array with a negative size
    static int test_array [1 - 2 * !(((long) (sizeof (npy_check_sizeof_type))) == 8)];
                           ^~~~~~~~~~~~~~~~~~~~~~~~~~~~~~~~~~~~~~~~~~~~~~~~~~~~~~~~~
1 error generated.
_configtest.c:5:28: error: 'test_array' declared as an array with a negative size
    static int test_array [1 - 2 * !(((long) (sizeof (npy_check_sizeof_type))) == 8)];
                           ^~~~~~~~~~~~~~~~~~~~~~~~~~~~~~~~~~~~~~~~~~~~~~~~~~~~~~~~~
1 error generated.
C compiler: cc -arch x86_64 -O2 -fPIC -Wimplicit -O2 -fPIC -Wimplicit -O2 -fPIC -Wimplicit

compile options: '-Inumpy/core/src/private -Inumpy/core/src -Inumpy/core -Inumpy/core/src/npymath -Inumpy/core/src/multiarray -Inumpy/core/src/umath -Inumpy/core/src/npysort -Inumpy/core/include -I/opt/pypy-2.2-osx64/include -c'
cc: _configtest.c
_configtest.c:5:28: error: 'test_array' declared as an array with a negative size
    static int test_array [1 - 2 * !(((long) (sizeof (npy_check_sizeof_type))) == 12)];
                           ^~~~~~~~~~~~~~~~~~~~~~~~~~~~~~~~~~~~~~~~~~~~~~~~~~~~~~~~~~
1 error generated.
_configtest.c:5:28: error: 'test_array' declared as an array with a negative size
    static int test_array [1 - 2 * !(((long) (sizeof (npy_check_sizeof_type))) == 12)];
                           ^~~~~~~~~~~~~~~~~~~~~~~~~~~~~~~~~~~~~~~~~~~~~~~~~~~~~~~~~~
1 error generated.
C compiler: cc -arch x86_64 -O2 -fPIC -Wimplicit -O2 -fPIC -Wimplicit -O2 -fPIC -Wimplicit

compile options: '-Inumpy/core/src/private -Inumpy/core/src -Inumpy/core -Inumpy/core/src/npymath -Inumpy/core/src/multiarray -Inumpy/core/src/umath -Inumpy/core/src/npysort -Inumpy/core/include -I/opt/pypy-2.2-osx64/include -c'
cc: _configtest.c
_configtest.c:5:28: error: 'test_array' declared as an array with a negative size
    static int test_array [1 - 2 * !(((long) (sizeof (npy_check_sizeof_type))) == 16)];
                           ^~~~~~~~~~~~~~~~~~~~~~~~~~~~~~~~~~~~~~~~~~~~~~~~~~~~~~~~~~
1 error generated.
_configtest.c:5:28: error: 'test_array' declared as an array with a negative size
    static int test_array [1 - 2 * !(((long) (sizeof (npy_check_sizeof_type))) == 16)];
                           ^~~~~~~~~~~~~~~~~~~~~~~~~~~~~~~~~~~~~~~~~~~~~~~~~~~~~~~~~~
1 error generated.
C compiler: cc -arch x86_64 -O2 -fPIC -Wimplicit -O2 -fPIC -Wimplicit -O2 -fPIC -Wimplicit

compile options: '-Inumpy/core/src/private -Inumpy/core/src -Inumpy/core -Inumpy/core/src/npymath -Inumpy/core/src/multiarray -Inumpy/core/src/umath -Inumpy/core/src/npysort -Inumpy/core/include -I/opt/pypy-2.2-osx64/include -c'
cc: _configtest.c
_configtest.c:5:28: error: 'test_array' declared as an array with a negative size
    static int test_array [1 - 2 * !(((long) (sizeof (npy_check_sizeof_type))) <= 0)];
                           ^~~~~~~~~~~~~~~~~~~~~~~~~~~~~~~~~~~~~~~~~~~~~~~~~~~~~~~~~
1 error generated.
_configtest.c:5:28: error: 'test_array' declared as an array with a negative size
    static int test_array [1 - 2 * !(((long) (sizeof (npy_check_sizeof_type))) <= 0)];
                           ^~~~~~~~~~~~~~~~~~~~~~~~~~~~~~~~~~~~~~~~~~~~~~~~~~~~~~~~~
1 error generated.
C compiler: cc -arch x86_64 -O2 -fPIC -Wimplicit -O2 -fPIC -Wimplicit -O2 -fPIC -Wimplicit

compile options: '-Inumpy/core/src/private -Inumpy/core/src -Inumpy/core -Inumpy/core/src/npymath -Inumpy/core/src/multiarray -Inumpy/core/src/umath -Inumpy/core/src/npysort -Inumpy/core/include -I/opt/pypy-2.2-osx64/include -c'
cc: _configtest.c
_configtest.c:5:28: error: 'test_array' declared as an array with a negative size
    static int test_array [1 - 2 * !(((long) (sizeof (npy_check_sizeof_type))) <= 1)];
                           ^~~~~~~~~~~~~~~~~~~~~~~~~~~~~~~~~~~~~~~~~~~~~~~~~~~~~~~~~
1 error generated.
_configtest.c:5:28: error: 'test_array' declared as an array with a negative size
    static int test_array [1 - 2 * !(((long) (sizeof (npy_check_sizeof_type))) <= 1)];
                           ^~~~~~~~~~~~~~~~~~~~~~~~~~~~~~~~~~~~~~~~~~~~~~~~~~~~~~~~~
1 error generated.
C compiler: cc -arch x86_64 -O2 -fPIC -Wimplicit -O2 -fPIC -Wimplicit -O2 -fPIC -Wimplicit

compile options: '-Inumpy/core/src/private -Inumpy/core/src -Inumpy/core -Inumpy/core/src/npymath -Inumpy/core/src/multiarray -Inumpy/core/src/umath -Inumpy/core/src/npysort -Inumpy/core/include -I/opt/pypy-2.2-osx64/include -c'
cc: _configtest.c
_configtest.c:5:28: error: 'test_array' declared as an array with a negative size
    static int test_array [1 - 2 * !(((long) (sizeof (npy_check_sizeof_type))) <= 3)];
                           ^~~~~~~~~~~~~~~~~~~~~~~~~~~~~~~~~~~~~~~~~~~~~~~~~~~~~~~~~
1 error generated.
_configtest.c:5:28: error: 'test_array' declared as an array with a negative size
    static int test_array [1 - 2 * !(((long) (sizeof (npy_check_sizeof_type))) <= 3)];
                           ^~~~~~~~~~~~~~~~~~~~~~~~~~~~~~~~~~~~~~~~~~~~~~~~~~~~~~~~~
1 error generated.
C compiler: cc -arch x86_64 -O2 -fPIC -Wimplicit -O2 -fPIC -Wimplicit -O2 -fPIC -Wimplicit

compile options: '-Inumpy/core/src/private -Inumpy/core/src -Inumpy/core -Inumpy/core/src/npymath -Inumpy/core/src/multiarray -Inumpy/core/src/umath -Inumpy/core/src/npysort -Inumpy/core/include -I/opt/pypy-2.2-osx64/include -c'
cc: _configtest.c
_configtest.c:5:28: error: 'test_array' declared as an array with a negative size
    static int test_array [1 - 2 * !(((long) (sizeof (npy_check_sizeof_type))) <= 7)];
                           ^~~~~~~~~~~~~~~~~~~~~~~~~~~~~~~~~~~~~~~~~~~~~~~~~~~~~~~~~
1 error generated.
_configtest.c:5:28: error: 'test_array' declared as an array with a negative size
    static int test_array [1 - 2 * !(((long) (sizeof (npy_check_sizeof_type))) <= 7)];
                           ^~~~~~~~~~~~~~~~~~~~~~~~~~~~~~~~~~~~~~~~~~~~~~~~~~~~~~~~~
1 error generated.
C compiler: cc -arch x86_64 -O2 -fPIC -Wimplicit -O2 -fPIC -Wimplicit -O2 -fPIC -Wimplicit

compile options: '-Inumpy/core/src/private -Inumpy/core/src -Inumpy/core -Inumpy/core/src/npymath -Inumpy/core/src/multiarray -Inumpy/core/src/umath -Inumpy/core/src/npysort -Inumpy/core/include -I/opt/pypy-2.2-osx64/include -c'
cc: _configtest.c
_configtest.c:5:28: error: 'test_array' declared as an array with a negative size
    static int test_array [1 - 2 * !(((long) (sizeof (npy_check_sizeof_type))) <= 15)];
                           ^~~~~~~~~~~~~~~~~~~~~~~~~~~~~~~~~~~~~~~~~~~~~~~~~~~~~~~~~~
1 error generated.
_configtest.c:5:28: error: 'test_array' declared as an array with a negative size
    static int test_array [1 - 2 * !(((long) (sizeof (npy_check_sizeof_type))) <= 15)];
                           ^~~~~~~~~~~~~~~~~~~~~~~~~~~~~~~~~~~~~~~~~~~~~~~~~~~~~~~~~~
1 error generated.
C compiler: cc -arch x86_64 -O2 -fPIC -Wimplicit -O2 -fPIC -Wimplicit -O2 -fPIC -Wimplicit

compile options: '-Inumpy/core/src/private -Inumpy/core/src -Inumpy/core -Inumpy/core/src/npymath -Inumpy/core/src/multiarray -Inumpy/core/src/umath -Inumpy/core/src/npysort -Inumpy/core/include -I/opt/pypy-2.2-osx64/include -c'
cc: _configtest.c
_configtest.c:5:28: error: 'test_array' declared as an array with a negative size
    static int test_array [1 - 2 * !(((long) (sizeof (npy_check_sizeof_type))) <= 31)];
                           ^~~~~~~~~~~~~~~~~~~~~~~~~~~~~~~~~~~~~~~~~~~~~~~~~~~~~~~~~~
1 error generated.
_configtest.c:5:28: error: 'test_array' declared as an array with a negative size
    static int test_array [1 - 2 * !(((long) (sizeof (npy_check_sizeof_type))) <= 31)];
                           ^~~~~~~~~~~~~~~~~~~~~~~~~~~~~~~~~~~~~~~~~~~~~~~~~~~~~~~~~~
1 error generated.
C compiler: cc -arch x86_64 -O2 -fPIC -Wimplicit -O2 -fPIC -Wimplicit -O2 -fPIC -Wimplicit

compile options: '-Inumpy/core/src/private -Inumpy/core/src -Inumpy/core -Inumpy/core/src/npymath -Inumpy/core/src/multiarray -Inumpy/core/src/umath -Inumpy/core/src/npysort -Inumpy/core/include -I/opt/pypy-2.2-osx64/include -c'
cc: _configtest.c
removing: _configtest.c _configtest.o _configtest.c _configtest.o _configtest.c _configtest.o _configtest.c _configtest.o _configtest.c _configtest.o _configtest.c _configtest.o _configtest.c _configtest.o _configtest.c _configtest.o _configtest.c _configtest.o _configtest.c _configtest.o _configtest.c _configtest.o _configtest.c _configtest.o _configtest.c _configtest.o
C compiler: cc -arch x86_64 -O2 -fPIC -Wimplicit -O2 -fPIC -Wimplicit -O2 -fPIC -Wimplicit

compile options: '-Inumpy/core/src/private -Inumpy/core/src -Inumpy/core -Inumpy/core/src/npymath -Inumpy/core/src/multiarray -Inumpy/core/src/umath -Inumpy/core/src/npysort -Inumpy/core/include -I/opt/pypy-2.2-osx64/include -c'
cc: _configtest.c
removing: _configtest.c _configtest.o
C compiler: cc -arch x86_64 -O2 -fPIC -Wimplicit -O2 -fPIC -Wimplicit -O2 -fPIC -Wimplicit

compile options: '-Inumpy/core/src/private -Inumpy/core/src -Inumpy/core -Inumpy/core/src/npymath -Inumpy/core/src/multiarray -Inumpy/core/src/umath -Inumpy/core/src/npysort -Inumpy/core/include -I/opt/pypy-2.2-osx64/include -c'
cc: _configtest.c
removing: _configtest.c _configtest.o
C compiler: cc -arch x86_64 -O2 -fPIC -Wimplicit -O2 -fPIC -Wimplicit -O2 -fPIC -Wimplicit

compile options: '-Inumpy/core/src/private -Inumpy/core/src -Inumpy/core -Inumpy/core/src/npymath -Inumpy/core/src/multiarray -Inumpy/core/src/umath -Inumpy/core/src/npysort -Inumpy/core/include -I/opt/pypy-2.2-osx64/include -c'
cc: _configtest.c
removing: _configtest.c _configtest.o
C compiler: cc -arch x86_64 -O2 -fPIC -Wimplicit -O2 -fPIC -Wimplicit -O2 -fPIC -Wimplicit

compile options: '-Inumpy/core/src/private -Inumpy/core/src -Inumpy/core -Inumpy/core/src/npymath -Inumpy/core/src/multiarray -Inumpy/core/src/umath -Inumpy/core/src/npysort -Inumpy/core/include -I/opt/pypy-2.2-osx64/include -c'
cc: _configtest.c
removing: _configtest.c _configtest.o
C compiler: cc -arch x86_64 -O2 -fPIC -Wimplicit -O2 -fPIC -Wimplicit -O2 -fPIC -Wimplicit

compile options: '-Inumpy/core/src/private -Inumpy/core/src -Inumpy/core -Inumpy/core/src/npymath -Inumpy/core/src/multiarray -Inumpy/core/src/umath -Inumpy/core/src/npysort -Inumpy/core/include -I/opt/pypy-2.2-osx64/include -c'
cc: _configtest.c
removing: _configtest.c _configtest.o
C compiler: cc -arch x86_64 -O2 -fPIC -Wimplicit -O2 -fPIC -Wimplicit -O2 -fPIC -Wimplicit

compile options: '-Inumpy/core/src/private -Inumpy/core/src -Inumpy/core -Inumpy/core/src/npymath -Inumpy/core/src/multiarray -Inumpy/core/src/umath -Inumpy/core/src/npysort -Inumpy/core/include -I/opt/pypy-2.2-osx64/include -c'
cc: _configtest.c
removing: _configtest.c _configtest.o
C compiler: cc -arch x86_64 -O2 -fPIC -Wimplicit -O2 -fPIC -Wimplicit -O2 -fPIC -Wimplicit

compile options: '-Inumpy/core/src/private -Inumpy/core/src -Inumpy/core -Inumpy/core/src/npymath -Inumpy/core/src/multiarray -Inumpy/core/src/umath -Inumpy/core/src/npysort -Inumpy/core/include -I/opt/pypy-2.2-osx64/include -c'
cc: _configtest.c
_configtest.c:7:28: error: 'test_array' declared as an array with a negative size
    static int test_array [1 - 2 * !(((long) (sizeof (npy_check_sizeof_type))) == 4)];
                           ^~~~~~~~~~~~~~~~~~~~~~~~~~~~~~~~~~~~~~~~~~~~~~~~~~~~~~~~~
1 error generated.
_configtest.c:7:28: error: 'test_array' declared as an array with a negative size
    static int test_array [1 - 2 * !(((long) (sizeof (npy_check_sizeof_type))) == 4)];
                           ^~~~~~~~~~~~~~~~~~~~~~~~~~~~~~~~~~~~~~~~~~~~~~~~~~~~~~~~~
1 error generated.
C compiler: cc -arch x86_64 -O2 -fPIC -Wimplicit -O2 -fPIC -Wimplicit -O2 -fPIC -Wimplicit

compile options: '-Inumpy/core/src/private -Inumpy/core/src -Inumpy/core -Inumpy/core/src/npymath -Inumpy/core/src/multiarray -Inumpy/core/src/umath -Inumpy/core/src/npysort -Inumpy/core/include -I/opt/pypy-2.2-osx64/include -c'
cc: _configtest.c
removing: _configtest.c _configtest.o _configtest.c _configtest.o
C compiler: cc -arch x86_64 -O2 -fPIC -Wimplicit -O2 -fPIC -Wimplicit -O2 -fPIC -Wimplicit

compile options: '-Inumpy/core/src/private -Inumpy/core/src -Inumpy/core -Inumpy/core/src/npymath -Inumpy/core/src/multiarray -Inumpy/core/src/umath -Inumpy/core/src/npysort -Inumpy/core/include -I/opt/pypy-2.2-osx64/include -c'
cc: _configtest.c
success!
removing: _configtest.c _configtest.o
C compiler: cc -arch x86_64 -O2 -fPIC -Wimplicit -O2 -fPIC -Wimplicit -O2 -fPIC -Wimplicit

compile options: '-Inumpy/core/src/private -Inumpy/core/src -Inumpy/core -Inumpy/core/src/npymath -Inumpy/core/src/multiarray -Inumpy/core/src/umath -Inumpy/core/src/npysort -Inumpy/core/include -I/opt/pypy-2.2-osx64/include -c'
cc: _configtest.c
removing: _configtest.c _configtest.o
C compiler: cc -arch x86_64 -O2 -fPIC -Wimplicit -O2 -fPIC -Wimplicit -O2 -fPIC -Wimplicit

compile options: '-Inumpy/core/src/private -Inumpy/core/src -Inumpy/core -Inumpy/core/src/npymath -Inumpy/core/src/multiarray -Inumpy/core/src/umath -Inumpy/core/src/npysort -Inumpy/core/include -I/opt/pypy-2.2-osx64/include -c'
cc: _configtest.c
removing: _configtest.c _configtest.o
C compiler: cc -arch x86_64 -O2 -fPIC -Wimplicit -O2 -fPIC -Wimplicit -O2 -fPIC -Wimplicit

compile options: '-Inumpy/core/src/private -Inumpy/core/src -Inumpy/core -Inumpy/core/src/npymath -Inumpy/core/src/multiarray -Inumpy/core/src/umath -Inumpy/core/src/npysort -Inumpy/core/include -I/opt/pypy-2.2-osx64/include -c'
cc: _configtest.c
removing: _configtest.c _configtest.o
C compiler: cc -arch x86_64 -O2 -fPIC -Wimplicit -O2 -fPIC -Wimplicit -O2 -fPIC -Wimplicit

compile options: '-Inumpy/core/src/private -Inumpy/core/src -Inumpy/core -Inumpy/core/src/npymath -Inumpy/core/src/multiarray -Inumpy/core/src/umath -Inumpy/core/src/npysort -Inumpy/core/include -I/opt/pypy-2.2-osx64/include -c'
cc: _configtest.c
removing: _configtest.c _configtest.o
C compiler: cc -arch x86_64 -O2 -fPIC -Wimplicit -O2 -fPIC -Wimplicit -O2 -fPIC -Wimplicit

compile options: '-Inumpy/core/src/private -Inumpy/core/src -Inumpy/core -Inumpy/core/src/npymath -Inumpy/core/src/multiarray -Inumpy/core/src/umath -Inumpy/core/src/npysort -Inumpy/core/include -I/opt/pypy-2.2-osx64/include -c'
cc: _configtest.c
success!
removing: _configtest.c _configtest.o
C compiler: cc -arch x86_64 -O2 -fPIC -Wimplicit -O2 -fPIC -Wimplicit -O2 -fPIC -Wimplicit

compile options: '-Inumpy/core/src/private -Inumpy/core/src -Inumpy/core -Inumpy/core/src/npymath -Inumpy/core/src/multiarray -Inumpy/core/src/umath -Inumpy/core/src/npysort -Inumpy/core/include -I/opt/pypy-2.2-osx64/include -c'
cc: _configtest.c
_configtest.c:1:5: warning: incompatible redeclaration of library function 'exp'
int exp (void);
    ^
_configtest.c:1:5: note: 'exp' is a builtin with type 'double (double)'
1 warning generated.
cc -arch x86_64 _configtest.o -o _configtest
success!
removing: _configtest.c _configtest.o _configtest
C compiler: cc -arch x86_64 -O2 -fPIC -Wimplicit -O2 -fPIC -Wimplicit -O2 -fPIC -Wimplicit

compile options: '-Inumpy/core/src/private -Inumpy/core/src -Inumpy/core -Inumpy/core/src/npymath -Inumpy/core/src/multiarray -Inumpy/core/src/umath -Inumpy/core/src/npysort -Inumpy/core/include -I/opt/pypy-2.2-osx64/include -c'
cc: _configtest.c
_configtest.c:1:5: warning: incompatible redeclaration of library function 'asin'
int asin (void);
    ^
_configtest.c:1:5: note: 'asin' is a builtin with type 'double (double)'
_configtest.c:2:5: warning: incompatible redeclaration of library function 'cos'
int cos (void);
    ^
_configtest.c:2:5: note: 'cos' is a builtin with type 'double (double)'
_configtest.c:3:5: warning: incompatible redeclaration of library function 'log'
int log (void);
    ^
_configtest.c:3:5: note: 'log' is a builtin with type 'double (double)'
_configtest.c:4:5: warning: incompatible redeclaration of library function 'fabs'
int fabs (void);
    ^
_configtest.c:4:5: note: 'fabs' is a builtin with type 'double (double)'
_configtest.c:6:5: warning: incompatible redeclaration of library function 'atan'
int atan (void);
    ^
_configtest.c:6:5: note: 'atan' is a builtin with type 'double (double)'
_configtest.c:7:5: warning: incompatible redeclaration of library function 'acos'
int acos (void);
    ^
_configtest.c:7:5: note: 'acos' is a builtin with type 'double (double)'
_configtest.c:8:5: warning: incompatible redeclaration of library function 'floor'
int floor (void);
    ^
_configtest.c:8:5: note: 'floor' is a builtin with type 'double (double)'
_configtest.c:10:5: warning: incompatible redeclaration of library function 'sqrt'
int sqrt (void);
    ^
_configtest.c:10:5: note: 'sqrt' is a builtin with type 'double (double)'
_configtest.c:15:5: warning: incompatible redeclaration of library function 'exp'
int exp (void);
    ^
_configtest.c:15:5: note: 'exp' is a builtin with type 'double (double)'
_configtest.c:16:5: warning: incompatible redeclaration of library function 'tan'
int tan (void);
    ^
_configtest.c:16:5: note: 'tan' is a builtin with type 'double (double)'
_configtest.c:17:5: warning: incompatible redeclaration of library function 'ceil'
int ceil (void);
    ^
_configtest.c:17:5: note: 'ceil' is a builtin with type 'double (double)'
_configtest.c:19:5: warning: incompatible redeclaration of library function 'sin'
int sin (void);
    ^
_configtest.c:19:5: note: 'sin' is a builtin with type 'double (double)'
12 warnings generated.
cc -arch x86_64 _configtest.o -o _configtest
success!
removing: _configtest.c _configtest.o _configtest
C compiler: cc -arch x86_64 -O2 -fPIC -Wimplicit -O2 -fPIC -Wimplicit -O2 -fPIC -Wimplicit

compile options: '-Inumpy/core/src/private -Inumpy/core/src -Inumpy/core -Inumpy/core/src/npymath -Inumpy/core/src/multiarray -Inumpy/core/src/umath -Inumpy/core/src/npysort -Inumpy/core/include -I/opt/pypy-2.2-osx64/include -c'
cc: _configtest.c
_configtest.c:8:12: error: use of undeclared identifier 'HAVE_EXPM1'
    (void) HAVE_EXPM1;
           ^
1 error generated.
_configtest.c:8:12: error: use of undeclared identifier 'HAVE_EXPM1'
    (void) HAVE_EXPM1;
           ^
1 error generated.
failure.
removing: _configtest.c _configtest.o
C compiler: cc -arch x86_64 -O2 -fPIC -Wimplicit -O2 -fPIC -Wimplicit -O2 -fPIC -Wimplicit

compile options: '-Inumpy/core/src/private -Inumpy/core/src -Inumpy/core -Inumpy/core/src/npymath -Inumpy/core/src/multiarray -Inumpy/core/src/umath -Inumpy/core/src/npysort -Inumpy/core/include -I/opt/pypy-2.2-osx64/include -c'
cc: _configtest.c
_configtest.c:8:12: error: use of undeclared identifier 'HAVE_LOG1P'
    (void) HAVE_LOG1P;
           ^
1 error generated.
_configtest.c:8:12: error: use of undeclared identifier 'HAVE_LOG1P'
    (void) HAVE_LOG1P;
           ^
1 error generated.
failure.
removing: _configtest.c _configtest.o
C compiler: cc -arch x86_64 -O2 -fPIC -Wimplicit -O2 -fPIC -Wimplicit -O2 -fPIC -Wimplicit

compile options: '-Inumpy/core/src/private -Inumpy/core/src -Inumpy/core -Inumpy/core/src/npymath -Inumpy/core/src/multiarray -Inumpy/core/src/umath -Inumpy/core/src/npysort -Inumpy/core/include -I/opt/pypy-2.2-osx64/include -c'
cc: _configtest.c
_configtest.c:8:12: error: use of undeclared identifier 'HAVE_ACOSH'
    (void) HAVE_ACOSH;
           ^
1 error generated.
_configtest.c:8:12: error: use of undeclared identifier 'HAVE_ACOSH'
    (void) HAVE_ACOSH;
           ^
1 error generated.
failure.
removing: _configtest.c _configtest.o
C compiler: cc -arch x86_64 -O2 -fPIC -Wimplicit -O2 -fPIC -Wimplicit -O2 -fPIC -Wimplicit

compile options: '-Inumpy/core/src/private -Inumpy/core/src -Inumpy/core -Inumpy/core/src/npymath -Inumpy/core/src/multiarray -Inumpy/core/src/umath -Inumpy/core/src/npysort -Inumpy/core/include -I/opt/pypy-2.2-osx64/include -c'
cc: _configtest.c
_configtest.c:8:12: error: use of undeclared identifier 'HAVE_ATANH'
    (void) HAVE_ATANH;
           ^
1 error generated.
_configtest.c:8:12: error: use of undeclared identifier 'HAVE_ATANH'
    (void) HAVE_ATANH;
           ^
1 error generated.
failure.
removing: _configtest.c _configtest.o
C compiler: cc -arch x86_64 -O2 -fPIC -Wimplicit -O2 -fPIC -Wimplicit -O2 -fPIC -Wimplicit

compile options: '-Inumpy/core/src/private -Inumpy/core/src -Inumpy/core -Inumpy/core/src/npymath -Inumpy/core/src/multiarray -Inumpy/core/src/umath -Inumpy/core/src/npysort -Inumpy/core/include -I/opt/pypy-2.2-osx64/include -c'
cc: _configtest.c
_configtest.c:8:12: error: use of undeclared identifier 'HAVE_ASINH'
    (void) HAVE_ASINH;
           ^
1 error generated.
_configtest.c:8:12: error: use of undeclared identifier 'HAVE_ASINH'
    (void) HAVE_ASINH;
           ^
1 error generated.
failure.
removing: _configtest.c _configtest.o
C compiler: cc -arch x86_64 -O2 -fPIC -Wimplicit -O2 -fPIC -Wimplicit -O2 -fPIC -Wimplicit

compile options: '-Inumpy/core/src/private -Inumpy/core/src -Inumpy/core -Inumpy/core/src/npymath -Inumpy/core/src/multiarray -Inumpy/core/src/umath -Inumpy/core/src/npysort -Inumpy/core/include -I/opt/pypy-2.2-osx64/include -c'
cc: _configtest.c
_configtest.c:8:12: error: use of undeclared identifier 'HAVE_HYPOT'
    (void) HAVE_HYPOT;
           ^
1 error generated.
_configtest.c:8:12: error: use of undeclared identifier 'HAVE_HYPOT'
    (void) HAVE_HYPOT;
           ^
1 error generated.
failure.
removing: _configtest.c _configtest.o
C compiler: cc -arch x86_64 -O2 -fPIC -Wimplicit -O2 -fPIC -Wimplicit -O2 -fPIC -Wimplicit

compile options: '-Inumpy/core/src/private -Inumpy/core/src -Inumpy/core -Inumpy/core/src/npymath -Inumpy/core/src/multiarray -Inumpy/core/src/umath -Inumpy/core/src/npysort -Inumpy/core/include -I/opt/pypy-2.2-osx64/include -c'
cc: _configtest.c
_configtest.c:8:12: error: use of undeclared identifier 'HAVE_COPYSIGN'
    (void) HAVE_COPYSIGN;
           ^
1 error generated.
_configtest.c:8:12: error: use of undeclared identifier 'HAVE_COPYSIGN'
    (void) HAVE_COPYSIGN;
           ^
1 error generated.
failure.
removing: _configtest.c _configtest.o
C compiler: cc -arch x86_64 -O2 -fPIC -Wimplicit -O2 -fPIC -Wimplicit -O2 -fPIC -Wimplicit

compile options: '-Inumpy/core/src/private -Inumpy/core/src -Inumpy/core -Inumpy/core/src/npymath -Inumpy/core/src/multiarray -Inumpy/core/src/umath -Inumpy/core/src/npysort -Inumpy/core/include -I/opt/pypy-2.2-osx64/include -c'
cc: _configtest.c
_configtest.c:3:5: warning: incompatible redeclaration of library function 'pow'
int pow (void);
    ^
_configtest.c:3:5: note: 'pow' is a builtin with type 'double (double, double)'
_configtest.c:8:5: warning: incompatible redeclaration of library function 'atan2'
int atan2 (void);
    ^
_configtest.c:8:5: note: 'atan2' is a builtin with type 'double (double, double)'
2 warnings generated.
cc -arch x86_64 _configtest.o -o _configtest
success!
removing: _configtest.c _configtest.o _configtest
C compiler: cc -arch x86_64 -O2 -fPIC -Wimplicit -O2 -fPIC -Wimplicit -O2 -fPIC -Wimplicit

compile options: '-Inumpy/core/src/private -Inumpy/core/src -Inumpy/core -Inumpy/core/src/npymath -Inumpy/core/src/multiarray -Inumpy/core/src/umath -Inumpy/core/src/npysort -Inumpy/core/include -I/opt/pypy-2.2-osx64/include -c'
cc: _configtest.c
cc -arch x86_64 _configtest.o -o _configtest
success!
removing: _configtest.c _configtest.o _configtest
C compiler: cc -arch x86_64 -O2 -fPIC -Wimplicit -O2 -fPIC -Wimplicit -O2 -fPIC -Wimplicit

compile options: '-Inumpy/core/src/private -Inumpy/core/src -Inumpy/core -Inumpy/core/src/npymath -Inumpy/core/src/multiarray -Inumpy/core/src/umath -Inumpy/core/src/npysort -Inumpy/core/include -I/opt/pypy-2.2-osx64/include -c'
cc: _configtest.c
cc -arch x86_64 _configtest.o -o _configtest
success!
removing: _configtest.c _configtest.o _configtest
C compiler: cc -arch x86_64 -O2 -fPIC -Wimplicit -O2 -fPIC -Wimplicit -O2 -fPIC -Wimplicit

compile options: '-Inumpy/core/src/private -Inumpy/core/src -Inumpy/core -Inumpy/core/src/npymath -Inumpy/core/src/multiarray -Inumpy/core/src/umath -Inumpy/core/src/npysort -Inumpy/core/include -I/opt/pypy-2.2-osx64/include -c'
cc: _configtest.c
_configtest.c:5:3: warning: ignoring return value of function declared with const attribute [-Wunused-value]
  __builtin_isnan(5.);
  ^~~~~~~~~~~~~~~ ~~
1 warning generated.
cc -arch x86_64 _configtest.o -o _configtest
success!
removing: _configtest.c _configtest.o _configtest
C compiler: cc -arch x86_64 -O2 -fPIC -Wimplicit -O2 -fPIC -Wimplicit -O2 -fPIC -Wimplicit

compile options: '-Inumpy/core/src/private -Inumpy/core/src -Inumpy/core -Inumpy/core/src/npymath -Inumpy/core/src/multiarray -Inumpy/core/src/umath -Inumpy/core/src/npysort -Inumpy/core/include -I/opt/pypy-2.2-osx64/include -c'
cc: _configtest.c
_configtest.c:5:3: warning: ignoring return value of function declared with const attribute [-Wunused-value]
  __builtin_isinf(5.);
  ^~~~~~~~~~~~~~~ ~~
1 warning generated.
cc -arch x86_64 _configtest.o -o _configtest
success!
removing: _configtest.c _configtest.o _configtest
C compiler: cc -arch x86_64 -O2 -fPIC -Wimplicit -O2 -fPIC -Wimplicit -O2 -fPIC -Wimplicit

compile options: '-Inumpy/core/src/private -Inumpy/core/src -Inumpy/core -Inumpy/core/src/npymath -Inumpy/core/src/multiarray -Inumpy/core/src/umath -Inumpy/core/src/npysort -Inumpy/core/include -I/opt/pypy-2.2-osx64/include -c'
cc: _configtest.c
_configtest.c:5:3: warning: ignoring return value of function declared with const attribute [-Wunused-value]
  __builtin_isfinite(5.);
  ^~~~~~~~~~~~~~~~~~ ~~
1 warning generated.
cc -arch x86_64 _configtest.o -o _configtest
success!
removing: _configtest.c _configtest.o _configtest
C compiler: cc -arch x86_64 -O2 -fPIC -Wimplicit -O2 -fPIC -Wimplicit -O2 -fPIC -Wimplicit

compile options: '-Inumpy/core/src/private -Inumpy/core/src -Inumpy/core -Inumpy/core/src/npymath -Inumpy/core/src/multiarray -Inumpy/core/src/umath -Inumpy/core/src/npysort -Inumpy/core/include -I/opt/pypy-2.2-osx64/include -c'
cc: _configtest.c
_configtest.c:5:3: warning: ignoring return value of function declared with const attribute [-Wunused-value]
  __builtin_bswap32(5u);
  ^~~~~~~~~~~~~~~~~ ~~
1 warning generated.
cc -arch x86_64 _configtest.o -o _configtest
success!
removing: _configtest.c _configtest.o _configtest
C compiler: cc -arch x86_64 -O2 -fPIC -Wimplicit -O2 -fPIC -Wimplicit -O2 -fPIC -Wimplicit

compile options: '-Inumpy/core/src/private -Inumpy/core/src -Inumpy/core -Inumpy/core/src/npymath -Inumpy/core/src/multiarray -Inumpy/core/src/umath -Inumpy/core/src/npysort -Inumpy/core/include -I/opt/pypy-2.2-osx64/include -c'
cc: _configtest.c
_configtest.c:5:3: warning: ignoring return value of function declared with const attribute [-Wunused-value]
  __builtin_bswap64(5u);
  ^~~~~~~~~~~~~~~~~ ~~
1 warning generated.
cc -arch x86_64 _configtest.o -o _configtest
success!
removing: _configtest.c _configtest.o _configtest
C compiler: cc -arch x86_64 -O2 -fPIC -Wimplicit -O2 -fPIC -Wimplicit -O2 -fPIC -Wimplicit

compile options: '-Inumpy/core/src/private -Inumpy/core/src -Inumpy/core -Inumpy/core/src/npymath -Inumpy/core/src/multiarray -Inumpy/core/src/umath -Inumpy/core/src/npysort -Inumpy/core/include -I/opt/pypy-2.2-osx64/include -c'
cc: _configtest.c
_configtest.c:5:3: warning: ignoring return value of function declared with const attribute [-Wunused-value]
  __builtin_expect(5, 0);
  ^~~~~~~~~~~~~~~~ ~~~~
1 warning generated.
cc -arch x86_64 _configtest.o -o _configtest
success!
removing: _configtest.c _configtest.o _configtest
C compiler: cc -arch x86_64 -O2 -fPIC -Wimplicit -O2 -fPIC -Wimplicit -O2 -fPIC -Wimplicit

compile options: '-Inumpy/core/src/private -Inumpy/core/src -Inumpy/core -Inumpy/core/src/npymath -Inumpy/core/src/multiarray -Inumpy/core/src/umath -Inumpy/core/src/npysort -Inumpy/core/include -I/opt/pypy-2.2-osx64/include -c'
cc: _configtest.c
cc -arch x86_64 _configtest.o -o _configtest
success!
removing: _configtest.c _configtest.o _configtest
C compiler: cc -arch x86_64 -O2 -fPIC -Wimplicit -O2 -fPIC -Wimplicit -O2 -fPIC -Wimplicit

compile options: '-Inumpy/core/src/private -Inumpy/core/src -Inumpy/core -Inumpy/core/src/npymath -Inumpy/core/src/multiarray -Inumpy/core/src/umath -Inumpy/core/src/npysort -Inumpy/core/include -I/opt/pypy-2.2-osx64/include -c'
cc: _configtest.c
cc -arch x86_64 _configtest.o -o _configtest
success!
removing: _configtest.c _configtest.o _configtest
C compiler: cc -arch x86_64 -O2 -fPIC -Wimplicit -O2 -fPIC -Wimplicit -O2 -fPIC -Wimplicit

compile options: '-Inumpy/core/src/private -Inumpy/core/src -Inumpy/core -Inumpy/core/src/npymath -Inumpy/core/src/multiarray -Inumpy/core/src/umath -Inumpy/core/src/npysort -Inumpy/core/include -I/opt/pypy-2.2-osx64/include -c'
cc: _configtest.c
_configtest.c:1:20: warning: unknown attribute 'optimize' ignored [-Wattributes]
int __attribute__((optimize("unroll-loops"))) attribute_optimize_unroll_loops (void);
                   ^
_configtest.c:6:3: warning: expression result unused [-Wunused-value]
  attribute_optimize_unroll_loops;
  ^~~~~~~~~~~~~~~~~~~~~~~~~~~~~~~
2 warnings generated.
cc -arch x86_64 _configtest.o -o _configtest
success!
removing: _configtest.c _configtest.o _configtest
C compiler: cc -arch x86_64 -O2 -fPIC -Wimplicit -O2 -fPIC -Wimplicit -O2 -fPIC -Wimplicit

compile options: '-Inumpy/core/src/private -Inumpy/core/src -Inumpy/core -Inumpy/core/src/npymath -Inumpy/core/src/multiarray -Inumpy/core/src/umath -Inumpy/core/src/npysort -Inumpy/core/include -I/opt/pypy-2.2-osx64/include -c'
cc: _configtest.c
_configtest.c:1:5: warning: incompatible redeclaration of library function 'cosf'
int cosf (void);
    ^
_configtest.c:1:5: note: 'cosf' is a builtin with type 'float (float)'
_configtest.c:4:5: warning: incompatible redeclaration of library function 'fabsf'
int fabsf (void);
    ^
_configtest.c:4:5: note: 'fabsf' is a builtin with type 'float (float)'
_configtest.c:5:5: warning: incompatible redeclaration of library function 'floorf'
int floorf (void);
    ^
_configtest.c:5:5: note: 'floorf' is a builtin with type 'float (float)'
_configtest.c:9:5: warning: incompatible redeclaration of library function 'logf'
int logf (void);
    ^
_configtest.c:9:5: note: 'logf' is a builtin with type 'float (float)'
_configtest.c:11:5: warning: incompatible redeclaration of library function 'acosf'
int acosf (void);
    ^
_configtest.c:11:5: note: 'acosf' is a builtin with type 'float (float)'
_configtest.c:12:5: warning: incompatible redeclaration of library function 'sqrtf'
int sqrtf (void);
    ^
_configtest.c:12:5: note: 'sqrtf' is a builtin with type 'float (float)'
_configtest.c:17:5: warning: incompatible redeclaration of library function 'atanf'
int atanf (void);
    ^
_configtest.c:17:5: note: 'atanf' is a builtin with type 'float (float)'
_configtest.c:19:5: warning: incompatible redeclaration of library function 'atan2f'
int atan2f (void);
    ^
_configtest.c:19:5: note: 'atan2f' is a builtin with type 'float (float, float)'
_configtest.c:21:5: warning: incompatible redeclaration of library function 'ceilf'
int ceilf (void);
    ^
_configtest.c:21:5: note: 'ceilf' is a builtin with type 'float (float)'
_configtest.c:23:5: warning: incompatible redeclaration of library function 'asinf'
int asinf (void);
    ^
_configtest.c:23:5: note: 'asinf' is a builtin with type 'float (float)'
_configtest.c:26:5: warning: incompatible redeclaration of library function 'sinf'
int sinf (void);
    ^
_configtest.c:26:5: note: 'sinf' is a builtin with type 'float (float)'
_configtest.c:27:5: warning: incompatible redeclaration of library function 'tanf'
int tanf (void);
    ^
_configtest.c:27:5: note: 'tanf' is a builtin with type 'float (float)'
_configtest.c:32:5: warning: incompatible redeclaration of library function 'powf'
int powf (void);
    ^
_configtest.c:32:5: note: 'powf' is a builtin with type 'float (float, float)'
_configtest.c:33:5: warning: incompatible redeclaration of library function 'expf'
int expf (void);
    ^
_configtest.c:33:5: note: 'expf' is a builtin with type 'float (float)'
14 warnings generated.
cc -arch x86_64 _configtest.o -o _configtest
success!
removing: _configtest.c _configtest.o _configtest
C compiler: cc -arch x86_64 -O2 -fPIC -Wimplicit -O2 -fPIC -Wimplicit -O2 -fPIC -Wimplicit

compile options: '-Inumpy/core/src/private -Inumpy/core/src -Inumpy/core -Inumpy/core/src/npymath -Inumpy/core/src/multiarray -Inumpy/core/src/umath -Inumpy/core/src/npysort -Inumpy/core/include -I/opt/pypy-2.2-osx64/include -c'
cc: _configtest.c
_configtest.c:5:5: warning: incompatible redeclaration of library function 'cosl'
int cosl (void);
    ^
_configtest.c:5:5: note: 'cosl' is a builtin with type 'long double (long double)'
_configtest.c:6:5: warning: incompatible redeclaration of library function 'floorl'
int floorl (void);
    ^
_configtest.c:6:5: note: 'floorl' is a builtin with type 'long double (long double)'
_configtest.c:8:5: warning: incompatible redeclaration of library function 'fabsl'
int fabsl (void);
    ^
_configtest.c:8:5: note: 'fabsl' is a builtin with type 'long double (long double)'
_configtest.c:9:5: warning: incompatible redeclaration of library function 'acosl'
int acosl (void);
    ^
_configtest.c:9:5: note: 'acosl' is a builtin with type 'long double (long double)'
_configtest.c:11:5: warning: incompatible redeclaration of library function 'sqrtl'
int sqrtl (void);
    ^
_configtest.c:11:5: note: 'sqrtl' is a builtin with type 'long double (long double)'
_configtest.c:12:5: warning: incompatible redeclaration of library function 'logl'
int logl (void);
    ^
_configtest.c:12:5: note: 'logl' is a builtin with type 'long double (long double)'
_configtest.c:18:5: warning: incompatible redeclaration of library function 'atanl'
int atanl (void);
    ^
_configtest.c:18:5: note: 'atanl' is a builtin with type 'long double (long double)'
_configtest.c:20:5: warning: incompatible redeclaration of library function 'atan2l'
int atan2l (void);
    ^
_configtest.c:20:5: note: 'atan2l' is a builtin with type 'long double (long double, long double)'
_configtest.c:24:5: warning: incompatible redeclaration of library function 'asinl'
int asinl (void);
    ^
_configtest.c:24:5: note: 'asinl' is a builtin with type 'long double (long double)'
_configtest.c:25:5: warning: incompatible redeclaration of library function 'ceill'
int ceill (void);
    ^
_configtest.c:25:5: note: 'ceill' is a builtin with type 'long double (long double)'
_configtest.c:26:5: warning: incompatible redeclaration of library function 'sinl'
int sinl (void);
    ^
_configtest.c:26:5: note: 'sinl' is a builtin with type 'long double (long double)'
_configtest.c:29:5: warning: incompatible redeclaration of library function 'tanl'
int tanl (void);
    ^
_configtest.c:29:5: note: 'tanl' is a builtin with type 'long double (long double)'
_configtest.c:31:5: warning: incompatible redeclaration of library function 'powl'
int powl (void);
    ^
_configtest.c:31:5: note: 'powl' is a builtin with type 'long double (long double, long double)'
_configtest.c:32:5: warning: incompatible redeclaration of library function 'expl'
int expl (void);
    ^
_configtest.c:32:5: note: 'expl' is a builtin with type 'long double (long double)'
14 warnings generated.
cc -arch x86_64 _configtest.o -o _configtest
success!
removing: _configtest.c _configtest.o _configtest
C compiler: cc -arch x86_64 -O2 -fPIC -Wimplicit -O2 -fPIC -Wimplicit -O2 -fPIC -Wimplicit

compile options: '-Inumpy/core/src/private -Inumpy/core/src -Inumpy/core -Inumpy/core/src/npymath -Inumpy/core/src/multiarray -Inumpy/core/src/umath -Inumpy/core/src/npysort -Inumpy/core/include -I/opt/pypy-2.2-osx64/include -c'
cc: _configtest.c
_configtest.c:8:12: error: use of undeclared identifier 'HAVE_DECL_ISNAN'
    (void) HAVE_DECL_ISNAN;
           ^
1 error generated.
_configtest.c:8:12: error: use of undeclared identifier 'HAVE_DECL_ISNAN'
    (void) HAVE_DECL_ISNAN;
           ^
1 error generated.
failure.
removing: _configtest.c _configtest.o
C compiler: cc -arch x86_64 -O2 -fPIC -Wimplicit -O2 -fPIC -Wimplicit -O2 -fPIC -Wimplicit

compile options: '-Inumpy/core/src/private -Inumpy/core/src -Inumpy/core -Inumpy/core/src/npymath -Inumpy/core/src/multiarray -Inumpy/core/src/umath -Inumpy/core/src/npysort -Inumpy/core/include -I/opt/pypy-2.2-osx64/include -c'
cc: _configtest.c
_configtest.c:8:12: error: use of undeclared identifier 'HAVE_DECL_ISINF'
    (void) HAVE_DECL_ISINF;
           ^
1 error generated.
_configtest.c:8:12: error: use of undeclared identifier 'HAVE_DECL_ISINF'
    (void) HAVE_DECL_ISINF;
           ^
1 error generated.
failure.
removing: _configtest.c _configtest.o
C compiler: cc -arch x86_64 -O2 -fPIC -Wimplicit -O2 -fPIC -Wimplicit -O2 -fPIC -Wimplicit

compile options: '-Inumpy/core/src/private -Inumpy/core/src -Inumpy/core -Inumpy/core/src/npymath -Inumpy/core/src/multiarray -Inumpy/core/src/umath -Inumpy/core/src/npysort -Inumpy/core/include -I/opt/pypy-2.2-osx64/include -c'
cc: _configtest.c
_configtest.c:8:12: error: use of undeclared identifier 'HAVE_DECL_SIGNBIT'
    (void) HAVE_DECL_SIGNBIT;
           ^
1 error generated.
_configtest.c:8:12: error: use of undeclared identifier 'HAVE_DECL_SIGNBIT'
    (void) HAVE_DECL_SIGNBIT;
           ^
1 error generated.
failure.
removing: _configtest.c _configtest.o
C compiler: cc -arch x86_64 -O2 -fPIC -Wimplicit -O2 -fPIC -Wimplicit -O2 -fPIC -Wimplicit

compile options: '-Inumpy/core/src/private -Inumpy/core/src -Inumpy/core -Inumpy/core/src/npymath -Inumpy/core/src/multiarray -Inumpy/core/src/umath -Inumpy/core/src/npysort -Inumpy/core/include -I/opt/pypy-2.2-osx64/include -c'
cc: _configtest.c
_configtest.c:8:12: error: use of undeclared identifier 'HAVE_DECL_ISFINITE'
    (void) HAVE_DECL_ISFINITE;
           ^
1 error generated.
_configtest.c:8:12: error: use of undeclared identifier 'HAVE_DECL_ISFINITE'
    (void) HAVE_DECL_ISFINITE;
           ^
1 error generated.
failure.
removing: _configtest.c _configtest.o
C compiler: cc -arch x86_64 -O2 -fPIC -Wimplicit -O2 -fPIC -Wimplicit -O2 -fPIC -Wimplicit

compile options: '-Inumpy/core/src/private -Inumpy/core/src -Inumpy/core -Inumpy/core/src/npymath -Inumpy/core/src/multiarray -Inumpy/core/src/umath -Inumpy/core/src/npysort -Inumpy/core/include -I/opt/pypy-2.2-osx64/include -c'
cc: _configtest.c
success!
removing: _configtest.c _configtest.o
C compiler: cc -arch x86_64 -O2 -fPIC -Wimplicit -O2 -fPIC -Wimplicit -O2 -fPIC -Wimplicit

compile options: '-Inumpy/core/src/private -Inumpy/core/src -Inumpy/core -Inumpy/core/src/npymath -Inumpy/core/src/multiarray -Inumpy/core/src/umath -Inumpy/core/src/npysort -Inumpy/core/include -I/opt/pypy-2.2-osx64/include -c'
cc: _configtest.c
success!
removing: _configtest.c _configtest.o
C compiler: cc -arch x86_64 -O2 -fPIC -Wimplicit -O2 -fPIC -Wimplicit -O2 -fPIC -Wimplicit

compile options: '-Inumpy/core/src/private -Inumpy/core/src -Inumpy/core -Inumpy/core/src/npymath -Inumpy/core/src/multiarray -Inumpy/core/src/umath -Inumpy/core/src/npysort -Inumpy/core/include -I/opt/pypy-2.2-osx64/include -c'
cc: _configtest.c
success!
removing: _configtest.c _configtest.o
C compiler: cc -arch x86_64 -O2 -fPIC -Wimplicit -O2 -fPIC -Wimplicit -O2 -fPIC -Wimplicit

compile options: '-Inumpy/core/src/private -Inumpy/core/src -Inumpy/core -Inumpy/core/src/npymath -Inumpy/core/src/multiarray -Inumpy/core/src/umath -Inumpy/core/src/npysort -Inumpy/core/include -I/opt/pypy-2.2-osx64/include -c'
cc: _configtest.c
success!
removing: _configtest.c _configtest.o
C compiler: cc -arch x86_64 -O2 -fPIC -Wimplicit -O2 -fPIC -Wimplicit -O2 -fPIC -Wimplicit

compile options: '-Inumpy/core/src/private -Inumpy/core/src -Inumpy/core -Inumpy/core/src/npymath -Inumpy/core/src/multiarray -Inumpy/core/src/umath -Inumpy/core/src/npysort -Inumpy/core/include -I/opt/pypy-2.2-osx64/include -c'
cc: _configtest.c
success!
removing: _configtest.c _configtest.o
C compiler: cc -arch x86_64 -O2 -fPIC -Wimplicit -O2 -fPIC -Wimplicit -O2 -fPIC -Wimplicit

compile options: '-Inumpy/core/src/private -Inumpy/core/src -Inumpy/core -Inumpy/core/src/npymath -Inumpy/core/src/multiarray -Inumpy/core/src/umath -Inumpy/core/src/npysort -Inumpy/core/include -I/opt/pypy-2.2-osx64/include -c'
cc: _configtest.c
removing: _configtest.c _configtest.o
C compiler: cc -arch x86_64 -O2 -fPIC -Wimplicit -O2 -fPIC -Wimplicit -O2 -fPIC -Wimplicit

compile options: '-Inumpy/core/src/private -Inumpy/core/src -Inumpy/core -Inumpy/core/src/npymath -Inumpy/core/src/multiarray -Inumpy/core/src/umath -Inumpy/core/src/npysort -Inumpy/core/include -I/opt/pypy-2.2-osx64/include -c'
cc: _configtest.c
removing: _configtest.c _configtest.o
C compiler: cc -arch x86_64 -O2 -fPIC -Wimplicit -O2 -fPIC -Wimplicit -O2 -fPIC -Wimplicit

compile options: '-Inumpy/core/src/private -Inumpy/core/src -Inumpy/core -Inumpy/core/src/npymath -Inumpy/core/src/multiarray -Inumpy/core/src/umath -Inumpy/core/src/npysort -Inumpy/core/include -I/opt/pypy-2.2-osx64/include -c'
cc: _configtest.c
removing: _configtest.c _configtest.o
C compiler: cc -arch x86_64 -O2 -fPIC -Wimplicit -O2 -fPIC -Wimplicit -O2 -fPIC -Wimplicit

compile options: '-Inumpy/core/src/private -Inumpy/core/src -Inumpy/core -Inumpy/core/src/npymath -Inumpy/core/src/multiarray -Inumpy/core/src/umath -Inumpy/core/src/npysort -Inumpy/core/include -I/opt/pypy-2.2-osx64/include -c'
cc: _configtest.c
cc -arch x86_64 _configtest.o -o _configtest
success!
removing: _configtest.c _configtest.o _configtest
C compiler: cc -arch x86_64 -O2 -fPIC -Wimplicit -O2 -fPIC -Wimplicit -O2 -fPIC -Wimplicit

compile options: '-Inumpy/core/src/private -Inumpy/core/src -Inumpy/core -Inumpy/core/src/npymath -Inumpy/core/src/multiarray -Inumpy/core/src/umath -Inumpy/core/src/npysort -Inumpy/core/include -I/opt/pypy-2.2-osx64/include -c'
cc: _configtest.c
cc -arch x86_64 _configtest.o -o _configtest
success!
removing: _configtest.c _configtest.o _configtest
C compiler: cc -arch x86_64 -O2 -fPIC -Wimplicit -O2 -fPIC -Wimplicit -O2 -fPIC -Wimplicit

compile options: '-Inumpy/core/src/private -Inumpy/core/src -Inumpy/core -Inumpy/core/src/npymath -Inumpy/core/src/multiarray -Inumpy/core/src/umath -Inumpy/core/src/npysort -Inumpy/core/include -I/opt/pypy-2.2-osx64/include -c'
cc: _configtest.c
cc -arch x86_64 _configtest.o -o _configtest
success!
removing: _configtest.c _configtest.o _configtest
C compiler: cc -arch x86_64 -O2 -fPIC -Wimplicit -O2 -fPIC -Wimplicit -O2 -fPIC -Wimplicit

compile options: '-Inumpy/core/src/private -Inumpy/core/src -Inumpy/core -Inumpy/core/src/npymath -Inumpy/core/src/multiarray -Inumpy/core/src/umath -Inumpy/core/src/npysort -Inumpy/core/include -I/opt/pypy-2.2-osx64/include -c'
cc: _configtest.c
success!
removing: _configtest.c _configtest.o
C compiler: cc -arch x86_64 -O2 -fPIC -Wimplicit -O2 -fPIC -Wimplicit -O2 -fPIC -Wimplicit

compile options: '-Inumpy/core/src/private -Inumpy/core/src -Inumpy/core -Inumpy/core/src/npymath -Inumpy/core/src/multiarray -Inumpy/core/src/umath -Inumpy/core/src/npysort -Inumpy/core/include -I/opt/pypy-2.2-osx64/include -c'
cc: _configtest.c
success!
removing: _configtest.c _configtest.o
File: build/src.macosx-10.8-x86_64-2.7/numpy/core/include/numpy/config.h
#define SIZEOF_FLOAT 4
#define SIZEOF_DOUBLE 8
#define SIZEOF_PY_INTPTR_T 8
#define SIZEOF_PY_LONG_LONG 8
#define MATHLIB 
#define HAVE_SIN 1
#define HAVE_COS 1
#define HAVE_TAN 1
#define HAVE_SINH 1
#define HAVE_COSH 1
#define HAVE_TANH 1
#define HAVE_FABS 1
#define HAVE_FLOOR 1
#define HAVE_CEIL 1
#define HAVE_SQRT 1
#define HAVE_LOG10 1
#define HAVE_LOG 1
#define HAVE_EXP 1
#define HAVE_ASIN 1
#define HAVE_ACOS 1
#define HAVE_ATAN 1
#define HAVE_FMOD 1
#define HAVE_MODF 1
#define HAVE_FREXP 1
#define HAVE_LDEXP 1
#define HAVE_EXPM1 1
#define HAVE_LOG1P 1
#define HAVE_ACOSH 1
#define HAVE_ASINH 1
#define HAVE_ATANH 1
#define HAVE_RINT 1
#define HAVE_TRUNC 1
#define HAVE_EXP2 1
#define HAVE_LOG2 1
#define HAVE_HYPOT 1
#define HAVE_ATAN2 1
#define HAVE_POW 1
#define HAVE_COPYSIGN 1
#define HAVE_NEXTAFTER 1
#define HAVE_XMMINTRIN_H 1
#define HAVE_EMMINTRIN_H 1
#define HAVE___BUILTIN_ISNAN 1
#define HAVE___BUILTIN_ISINF 1
#define HAVE___BUILTIN_ISFINITE 1
#define HAVE___BUILTIN_BSWAP32 1
#define HAVE___BUILTIN_BSWAP64 1
#define HAVE___BUILTIN_EXPECT 1
#define HAVE__MM_LOAD_PS 1
#define HAVE__MM_LOAD_PD 1
#define HAVE_ATTRIBUTE_OPTIMIZE_UNROLL_LOOPS 1
#define HAVE_SINF 1
#define HAVE_COSF 1
#define HAVE_TANF 1
#define HAVE_SINHF 1
#define HAVE_COSHF 1
#define HAVE_TANHF 1
#define HAVE_FABSF 1
#define HAVE_FLOORF 1
#define HAVE_CEILF 1
#define HAVE_RINTF 1
#define HAVE_TRUNCF 1
#define HAVE_SQRTF 1
#define HAVE_LOG10F 1
#define HAVE_LOGF 1
#define HAVE_LOG1PF 1
#define HAVE_EXPF 1
#define HAVE_EXPM1F 1
#define HAVE_ASINF 1
#define HAVE_ACOSF 1
#define HAVE_ATANF 1
#define HAVE_ASINHF 1
#define HAVE_ACOSHF 1
#define HAVE_ATANHF 1
#define HAVE_HYPOTF 1
#define HAVE_ATAN2F 1
#define HAVE_POWF 1
#define HAVE_FMODF 1
#define HAVE_MODFF 1
#define HAVE_FREXPF 1
#define HAVE_LDEXPF 1
#define HAVE_EXP2F 1
#define HAVE_LOG2F 1
#define HAVE_COPYSIGNF 1
#define HAVE_NEXTAFTERF 1
#define HAVE_SINL 1
#define HAVE_COSL 1
#define HAVE_TANL 1
#define HAVE_SINHL 1
#define HAVE_COSHL 1
#define HAVE_TANHL 1
#define HAVE_FABSL 1
#define HAVE_FLOORL 1
#define HAVE_CEILL 1
#define HAVE_RINTL 1
#define HAVE_TRUNCL 1
#define HAVE_SQRTL 1
#define HAVE_LOG10L 1
#define HAVE_LOGL 1
#define HAVE_LOG1PL 1
#define HAVE_EXPL 1
#define HAVE_EXPM1L 1
#define HAVE_ASINL 1
#define HAVE_ACOSL 1
#define HAVE_ATANL 1
#define HAVE_ASINHL 1
#define HAVE_ACOSHL 1
#define HAVE_ATANHL 1
#define HAVE_HYPOTL 1
#define HAVE_ATAN2L 1
#define HAVE_POWL 1
#define HAVE_FMODL 1
#define HAVE_MODFL 1
#define HAVE_FREXPL 1
#define HAVE_LDEXPL 1
#define HAVE_EXP2L 1
#define HAVE_LOG2L 1
#define HAVE_COPYSIGNL 1
#define HAVE_NEXTAFTERL 1
#define HAVE_DECL_ISNAN
#define HAVE_DECL_ISINF
#define HAVE_DECL_SIGNBIT
#define HAVE_DECL_ISFINITE
#define HAVE_COMPLEX_H 1
#define HAVE_CREAL 1
#define HAVE_CIMAG 1
#define HAVE_CABS 1
#define HAVE_CARG 1
#define HAVE_CEXP 1
#define HAVE_CSQRT 1
#define HAVE_CLOG 1
#define HAVE_CCOS 1
#define HAVE_CSIN 1
#define HAVE_CPOW 1
#define HAVE_CREALF 1
#define HAVE_CIMAGF 1
#define HAVE_CABSF 1
#define HAVE_CARGF 1
#define HAVE_CEXPF 1
#define HAVE_CSQRTF 1
#define HAVE_CLOGF 1
#define HAVE_CCOSF 1
#define HAVE_CSINF 1
#define HAVE_CPOWF 1
#define HAVE_CREALL 1
#define HAVE_CIMAGL 1
#define HAVE_CABSL 1
#define HAVE_CARGL 1
#define HAVE_CEXPL 1
#define HAVE_CSQRTL 1
#define HAVE_CLOGL 1
#define HAVE_CCOSL 1
#define HAVE_CSINL 1
#define HAVE_CPOWL 1
#define ENABLE_SEPARATE_COMPILATION 1
#ifndef __cplusplus
/* #undef inline */
#endif

#ifndef _NPY_NPY_CONFIG_H_
#error config.h should never be included directly, include npy_config.h instead
#endif

EOF
  adding 'build/src.macosx-10.8-x86_64-2.7/numpy/core/include/numpy/config.h' to sources.
Generating build/src.macosx-10.8-x86_64-2.7/numpy/core/include/numpy/_numpyconfig.h
C compiler: cc -arch x86_64 -O2 -fPIC -Wimplicit -O2 -fPIC -Wimplicit -O2 -fPIC -Wimplicit

compile options: '-Inumpy/core/src/private -Inumpy/core/src -Inumpy/core -Inumpy/core/src/npymath -Inumpy/core/src/multiarray -Inumpy/core/src/umath -Inumpy/core/src/npysort -Inumpy/core/include -I/opt/pypy-2.2-osx64/include -c'
cc: _configtest.c
_configtest.c:1:5: warning: incompatible redeclaration of library function 'exp'
int exp (void);
    ^
_configtest.c:1:5: note: 'exp' is a builtin with type 'double (double)'
1 warning generated.
cc -arch x86_64 _configtest.o -o _configtest
success!
removing: _configtest.c _configtest.o _configtest
C compiler: cc -arch x86_64 -O2 -fPIC -Wimplicit -O2 -fPIC -Wimplicit -O2 -fPIC -Wimplicit

compile options: '-Inumpy/core/src/private -Inumpy/core/src -Inumpy/core -Inumpy/core/src/npymath -Inumpy/core/src/multiarray -Inumpy/core/src/umath -Inumpy/core/src/npysort -Inumpy/core/include -I/opt/pypy-2.2-osx64/include -c'
cc: _configtest.c
success!
removing: _configtest.c _configtest.o
C compiler: cc -arch x86_64 -O2 -fPIC -Wimplicit -O2 -fPIC -Wimplicit -O2 -fPIC -Wimplicit

compile options: '-Inumpy/core/src/private -Inumpy/core/src -Inumpy/core -Inumpy/core/src/npymath -Inumpy/core/src/multiarray -Inumpy/core/src/umath -Inumpy/core/src/npysort -Inumpy/core/include -I/opt/pypy-2.2-osx64/include -c'
cc: _configtest.c
_configtest.c:5:18: warning: extra tokens at end of #ifndef directive [-Wextra-tokens]
#ifndef __GNUC__ && (__GNUC__ >= 4)
                 ^
                 //
1 warning generated.
success!
removing: _configtest.c _configtest.o
File: build/src.macosx-10.8-x86_64-2.7/numpy/core/include/numpy/_numpyconfig.h
#define NPY_SIZEOF_SHORT SIZEOF_SHORT
#define NPY_SIZEOF_INT SIZEOF_INT
#define NPY_SIZEOF_LONG SIZEOF_LONG
#define NPY_SIZEOF_FLOAT 4
#define NPY_SIZEOF_COMPLEX_FLOAT 8
#define NPY_SIZEOF_DOUBLE 8
#define NPY_SIZEOF_COMPLEX_DOUBLE 16
#define NPY_SIZEOF_LONGDOUBLE 16
#define NPY_SIZEOF_COMPLEX_LONGDOUBLE 32
#define NPY_SIZEOF_PY_INTPTR_T 8
#define NPY_SIZEOF_PY_LONG_LONG 8
#define NPY_SIZEOF_LONGLONG 8
#define NPY_NO_SMP 0
#define NPY_HAVE_DECL_ISNAN
#define NPY_HAVE_DECL_ISINF
#define NPY_HAVE_DECL_SIGNBIT
#define NPY_HAVE_DECL_ISFINITE
#define NPY_USE_C99_COMPLEX 1
#define NPY_HAVE_COMPLEX_DOUBLE 1
#define NPY_HAVE_COMPLEX_FLOAT 1
#define NPY_HAVE_COMPLEX_LONG_DOUBLE 1
#define NPY_ENABLE_SEPARATE_COMPILATION 1
#define NPY_USE_C99_FORMATS 1
#define NPY_VISIBILITY_HIDDEN __attribute__((visibility("hidden")))
#define NPY_ABI_VERSION 0x01000009
#define NPY_API_VERSION 0x00000009

#ifndef __STDC_FORMAT_MACROS
#define __STDC_FORMAT_MACROS 1
#endif

EOF
  adding 'build/src.macosx-10.8-x86_64-2.7/numpy/core/include/numpy/_numpyconfig.h' to sources.
executing numpy/core/code_generators/generate_numpy_api.py
  adding 'build/src.macosx-10.8-x86_64-2.7/numpy/core/include/numpy/__multiarray_api.h' to sources.
numpy.core - nothing done with h_files = ['build/src.macosx-10.8-x86_64-2.7/numpy/core/include/numpy/config.h', 'build/src.macosx-10.8-x86_64-2.7/numpy/core/include/numpy/_numpyconfig.h', 'build/src.macosx-10.8-x86_64-2.7/numpy/core/include/numpy/__multiarray_api.h']
building extension "numpy.linalg.lapack_lite" sources
creating build/src.macosx-10.8-x86_64-2.7/numpy/linalg
  adding 'numpy/linalg/lapack_litemodule.c' to sources.
  adding 'numpy/linalg/lapack_lite/python_xerbla.c' to sources.
building data_files sources
build_src: building npy-pkg config files
running build_py
creating build/lib.macosx-10.8-x86_64-2.7
creating build/lib.macosx-10.8-x86_64-2.7/numpy
copying numpy/__init__.py -> build/lib.macosx-10.8-x86_64-2.7/numpy
copying numpy/_import_tools.py -> build/lib.macosx-10.8-x86_64-2.7/numpy
copying numpy/add_newdocs.py -> build/lib.macosx-10.8-x86_64-2.7/numpy
copying numpy/ctypeslib.py -> build/lib.macosx-10.8-x86_64-2.7/numpy
copying numpy/dual.py -> build/lib.macosx-10.8-x86_64-2.7/numpy
copying numpy/matlib.py -> build/lib.macosx-10.8-x86_64-2.7/numpy
copying numpy/setup.py -> build/lib.macosx-10.8-x86_64-2.7/numpy
copying numpy/version.py -> build/lib.macosx-10.8-x86_64-2.7/numpy
copying build/src.macosx-10.8-x86_64-2.7/numpy/__config__.py -> build/lib.macosx-10.8-x86_64-2.7/numpy
creating build/lib.macosx-10.8-x86_64-2.7/numpy/distutils
copying numpy/distutils/__init__.py -> build/lib.macosx-10.8-x86_64-2.7/numpy/distutils
copying numpy/distutils/__version__.py -> build/lib.macosx-10.8-x86_64-2.7/numpy/distutils
copying numpy/distutils/ccompiler.py -> build/lib.macosx-10.8-x86_64-2.7/numpy/distutils
copying numpy/distutils/compat.py -> build/lib.macosx-10.8-x86_64-2.7/numpy/distutils
copying numpy/distutils/conv_template.py -> build/lib.macosx-10.8-x86_64-2.7/numpy/distutils
copying numpy/distutils/core.py -> build/lib.macosx-10.8-x86_64-2.7/numpy/distutils
copying numpy/distutils/cpuinfo.py -> build/lib.macosx-10.8-x86_64-2.7/numpy/distutils
copying numpy/distutils/environment.py -> build/lib.macosx-10.8-x86_64-2.7/numpy/distutils
copying numpy/distutils/exec_command.py -> build/lib.macosx-10.8-x86_64-2.7/numpy/distutils
copying numpy/distutils/extension.py -> build/lib.macosx-10.8-x86_64-2.7/numpy/distutils
copying numpy/distutils/from_template.py -> build/lib.macosx-10.8-x86_64-2.7/numpy/distutils
copying numpy/distutils/info.py -> build/lib.macosx-10.8-x86_64-2.7/numpy/distutils
copying numpy/distutils/intelccompiler.py -> build/lib.macosx-10.8-x86_64-2.7/numpy/distutils
copying numpy/distutils/lib2def.py -> build/lib.macosx-10.8-x86_64-2.7/numpy/distutils
copying numpy/distutils/line_endings.py -> build/lib.macosx-10.8-x86_64-2.7/numpy/distutils
copying numpy/distutils/log.py -> build/lib.macosx-10.8-x86_64-2.7/numpy/distutils
copying numpy/distutils/mingw32ccompiler.py -> build/lib.macosx-10.8-x86_64-2.7/numpy/distutils
copying numpy/distutils/misc_util.py -> build/lib.macosx-10.8-x86_64-2.7/numpy/distutils
copying numpy/distutils/npy_pkg_config.py -> build/lib.macosx-10.8-x86_64-2.7/numpy/distutils
copying numpy/distutils/numpy_distribution.py -> build/lib.macosx-10.8-x86_64-2.7/numpy/distutils
copying numpy/distutils/pathccompiler.py -> build/lib.macosx-10.8-x86_64-2.7/numpy/distutils
copying numpy/distutils/setup.py -> build/lib.macosx-10.8-x86_64-2.7/numpy/distutils
copying numpy/distutils/system_info.py -> build/lib.macosx-10.8-x86_64-2.7/numpy/distutils
copying numpy/distutils/unixccompiler.py -> build/lib.macosx-10.8-x86_64-2.7/numpy/distutils
copying build/src.macosx-10.8-x86_64-2.7/numpy/distutils/__config__.py -> build/lib.macosx-10.8-x86_64-2.7/numpy/distutils
creating build/lib.macosx-10.8-x86_64-2.7/numpy/distutils/command
copying numpy/distutils/command/__init__.py -> build/lib.macosx-10.8-x86_64-2.7/numpy/distutils/command
copying numpy/distutils/command/autodist.py -> build/lib.macosx-10.8-x86_64-2.7/numpy/distutils/command
copying numpy/distutils/command/bdist_rpm.py -> build/lib.macosx-10.8-x86_64-2.7/numpy/distutils/command
copying numpy/distutils/command/build.py -> build/lib.macosx-10.8-x86_64-2.7/numpy/distutils/command
copying numpy/distutils/command/build_clib.py -> build/lib.macosx-10.8-x86_64-2.7/numpy/distutils/command
copying numpy/distutils/command/build_ext.py -> build/lib.macosx-10.8-x86_64-2.7/numpy/distutils/command
copying numpy/distutils/command/build_py.py -> build/lib.macosx-10.8-x86_64-2.7/numpy/distutils/command
copying numpy/distutils/command/build_scripts.py -> build/lib.macosx-10.8-x86_64-2.7/numpy/distutils/command
copying numpy/distutils/command/build_src.py -> build/lib.macosx-10.8-x86_64-2.7/numpy/distutils/command
copying numpy/distutils/command/config.py -> build/lib.macosx-10.8-x86_64-2.7/numpy/distutils/command
copying numpy/distutils/command/config_compiler.py -> build/lib.macosx-10.8-x86_64-2.7/numpy/distutils/command
copying numpy/distutils/command/develop.py -> build/lib.macosx-10.8-x86_64-2.7/numpy/distutils/command
copying numpy/distutils/command/egg_info.py -> build/lib.macosx-10.8-x86_64-2.7/numpy/distutils/command
copying numpy/distutils/command/install.py -> build/lib.macosx-10.8-x86_64-2.7/numpy/distutils/command
copying numpy/distutils/command/install_clib.py -> build/lib.macosx-10.8-x86_64-2.7/numpy/distutils/command
copying numpy/distutils/command/install_data.py -> build/lib.macosx-10.8-x86_64-2.7/numpy/distutils/command
copying numpy/distutils/command/install_headers.py -> build/lib.macosx-10.8-x86_64-2.7/numpy/distutils/command
copying numpy/distutils/command/sdist.py -> build/lib.macosx-10.8-x86_64-2.7/numpy/distutils/command
creating build/lib.macosx-10.8-x86_64-2.7/numpy/distutils/fcompiler
copying numpy/distutils/fcompiler/__init__.py -> build/lib.macosx-10.8-x86_64-2.7/numpy/distutils/fcompiler
copying numpy/distutils/fcompiler/absoft.py -> build/lib.macosx-10.8-x86_64-2.7/numpy/distutils/fcompiler
copying numpy/distutils/fcompiler/compaq.py -> build/lib.macosx-10.8-x86_64-2.7/numpy/distutils/fcompiler
copying numpy/distutils/fcompiler/g95.py -> build/lib.macosx-10.8-x86_64-2.7/numpy/distutils/fcompiler
copying numpy/distutils/fcompiler/gnu.py -> build/lib.macosx-10.8-x86_64-2.7/numpy/distutils/fcompiler
copying numpy/distutils/fcompiler/hpux.py -> build/lib.macosx-10.8-x86_64-2.7/numpy/distutils/fcompiler
copying numpy/distutils/fcompiler/ibm.py -> build/lib.macosx-10.8-x86_64-2.7/numpy/distutils/fcompiler
copying numpy/distutils/fcompiler/intel.py -> build/lib.macosx-10.8-x86_64-2.7/numpy/distutils/fcompiler
copying numpy/distutils/fcompiler/lahey.py -> build/lib.macosx-10.8-x86_64-2.7/numpy/distutils/fcompiler
copying numpy/distutils/fcompiler/mips.py -> build/lib.macosx-10.8-x86_64-2.7/numpy/distutils/fcompiler
copying numpy/distutils/fcompiler/nag.py -> build/lib.macosx-10.8-x86_64-2.7/numpy/distutils/fcompiler
copying numpy/distutils/fcompiler/none.py -> build/lib.macosx-10.8-x86_64-2.7/numpy/distutils/fcompiler
copying numpy/distutils/fcompiler/pathf95.py -> build/lib.macosx-10.8-x86_64-2.7/numpy/distutils/fcompiler
copying numpy/distutils/fcompiler/pg.py -> build/lib.macosx-10.8-x86_64-2.7/numpy/distutils/fcompiler
copying numpy/distutils/fcompiler/sun.py -> build/lib.macosx-10.8-x86_64-2.7/numpy/distutils/fcompiler
copying numpy/distutils/fcompiler/vast.py -> build/lib.macosx-10.8-x86_64-2.7/numpy/distutils/fcompiler
creating build/lib.macosx-10.8-x86_64-2.7/numpy/testing
copying numpy/testing/__init__.py -> build/lib.macosx-10.8-x86_64-2.7/numpy/testing
copying numpy/testing/decorators.py -> build/lib.macosx-10.8-x86_64-2.7/numpy/testing
copying numpy/testing/noseclasses.py -> build/lib.macosx-10.8-x86_64-2.7/numpy/testing
copying numpy/testing/nosetester.py -> build/lib.macosx-10.8-x86_64-2.7/numpy/testing
copying numpy/testing/numpytest.py -> build/lib.macosx-10.8-x86_64-2.7/numpy/testing
copying numpy/testing/print_coercion_tables.py -> build/lib.macosx-10.8-x86_64-2.7/numpy/testing
copying numpy/testing/setup.py -> build/lib.macosx-10.8-x86_64-2.7/numpy/testing
copying numpy/testing/utils.py -> build/lib.macosx-10.8-x86_64-2.7/numpy/testing
creating build/lib.macosx-10.8-x86_64-2.7/numpy/f2py
copying numpy/f2py/__init__.py -> build/lib.macosx-10.8-x86_64-2.7/numpy/f2py
copying numpy/f2py/__version__.py -> build/lib.macosx-10.8-x86_64-2.7/numpy/f2py
copying numpy/f2py/auxfuncs.py -> build/lib.macosx-10.8-x86_64-2.7/numpy/f2py
copying numpy/f2py/capi_maps.py -> build/lib.macosx-10.8-x86_64-2.7/numpy/f2py
copying numpy/f2py/cb_rules.py -> build/lib.macosx-10.8-x86_64-2.7/numpy/f2py
copying numpy/f2py/cfuncs.py -> build/lib.macosx-10.8-x86_64-2.7/numpy/f2py
copying numpy/f2py/common_rules.py -> build/lib.macosx-10.8-x86_64-2.7/numpy/f2py
copying numpy/f2py/crackfortran.py -> build/lib.macosx-10.8-x86_64-2.7/numpy/f2py
copying numpy/f2py/diagnose.py -> build/lib.macosx-10.8-x86_64-2.7/numpy/f2py
copying numpy/f2py/f2py2e.py -> build/lib.macosx-10.8-x86_64-2.7/numpy/f2py
copying numpy/f2py/f2py_testing.py -> build/lib.macosx-10.8-x86_64-2.7/numpy/f2py
copying numpy/f2py/f90mod_rules.py -> build/lib.macosx-10.8-x86_64-2.7/numpy/f2py
copying numpy/f2py/func2subr.py -> build/lib.macosx-10.8-x86_64-2.7/numpy/f2py
copying numpy/f2py/info.py -> build/lib.macosx-10.8-x86_64-2.7/numpy/f2py
copying numpy/f2py/rules.py -> build/lib.macosx-10.8-x86_64-2.7/numpy/f2py
copying numpy/f2py/setup.py -> build/lib.macosx-10.8-x86_64-2.7/numpy/f2py
copying numpy/f2py/use_rules.py -> build/lib.macosx-10.8-x86_64-2.7/numpy/f2py
creating build/lib.macosx-10.8-x86_64-2.7/numpy/core
copying numpy/core/__init__.py -> build/lib.macosx-10.8-x86_64-2.7/numpy/core
copying numpy/core/_internal.py -> build/lib.macosx-10.8-x86_64-2.7/numpy/core
copying numpy/core/_methods.py -> build/lib.macosx-10.8-x86_64-2.7/numpy/core
copying numpy/core/arrayprint.py -> build/lib.macosx-10.8-x86_64-2.7/numpy/core
copying numpy/core/defchararray.py -> build/lib.macosx-10.8-x86_64-2.7/numpy/core
copying numpy/core/fromnumeric.py -> build/lib.macosx-10.8-x86_64-2.7/numpy/core
copying numpy/core/function_base.py -> build/lib.macosx-10.8-x86_64-2.7/numpy/core
copying numpy/core/getlimits.py -> build/lib.macosx-10.8-x86_64-2.7/numpy/core
copying numpy/core/info.py -> build/lib.macosx-10.8-x86_64-2.7/numpy/core
copying numpy/core/machar.py -> build/lib.macosx-10.8-x86_64-2.7/numpy/core
copying numpy/core/memmap.py -> build/lib.macosx-10.8-x86_64-2.7/numpy/core
copying numpy/core/multiarray.py -> build/lib.macosx-10.8-x86_64-2.7/numpy/core
copying numpy/core/numeric.py -> build/lib.macosx-10.8-x86_64-2.7/numpy/core
copying numpy/core/numerictypes.py -> build/lib.macosx-10.8-x86_64-2.7/numpy/core
copying numpy/core/records.py -> build/lib.macosx-10.8-x86_64-2.7/numpy/core
copying numpy/core/scalarmath.py -> build/lib.macosx-10.8-x86_64-2.7/numpy/core
copying numpy/core/setup.py -> build/lib.macosx-10.8-x86_64-2.7/numpy/core
copying numpy/core/setup_common.py -> build/lib.macosx-10.8-x86_64-2.7/numpy/core
copying numpy/core/shape_base.py -> build/lib.macosx-10.8-x86_64-2.7/numpy/core
copying numpy/core/umath.py -> build/lib.macosx-10.8-x86_64-2.7/numpy/core
creating build/lib.macosx-10.8-x86_64-2.7/numpy/lib
copying numpy/lib/__init__.py -> build/lib.macosx-10.8-x86_64-2.7/numpy/lib
copying numpy/lib/_compiled_base.py -> build/lib.macosx-10.8-x86_64-2.7/numpy/lib
copying numpy/lib/_datasource.py -> build/lib.macosx-10.8-x86_64-2.7/numpy/lib
copying numpy/lib/_iotools.py -> build/lib.macosx-10.8-x86_64-2.7/numpy/lib
copying numpy/lib/arraypad.py -> build/lib.macosx-10.8-x86_64-2.7/numpy/lib
copying numpy/lib/arraysetops.py -> build/lib.macosx-10.8-x86_64-2.7/numpy/lib
copying numpy/lib/arrayterator.py -> build/lib.macosx-10.8-x86_64-2.7/numpy/lib
copying numpy/lib/financial.py -> build/lib.macosx-10.8-x86_64-2.7/numpy/lib
copying numpy/lib/format.py -> build/lib.macosx-10.8-x86_64-2.7/numpy/lib
copying numpy/lib/function_base.py -> build/lib.macosx-10.8-x86_64-2.7/numpy/lib
copying numpy/lib/index_tricks.py -> build/lib.macosx-10.8-x86_64-2.7/numpy/lib
copying numpy/lib/info.py -> build/lib.macosx-10.8-x86_64-2.7/numpy/lib
copying numpy/lib/nanfunctions.py -> build/lib.macosx-10.8-x86_64-2.7/numpy/lib
copying numpy/lib/npyio.py -> build/lib.macosx-10.8-x86_64-2.7/numpy/lib
copying numpy/lib/polynomial.py -> build/lib.macosx-10.8-x86_64-2.7/numpy/lib
copying numpy/lib/recfunctions.py -> build/lib.macosx-10.8-x86_64-2.7/numpy/lib
copying numpy/lib/scimath.py -> build/lib.macosx-10.8-x86_64-2.7/numpy/lib
copying numpy/lib/setup.py -> build/lib.macosx-10.8-x86_64-2.7/numpy/lib
copying numpy/lib/shape_base.py -> build/lib.macosx-10.8-x86_64-2.7/numpy/lib
copying numpy/lib/stride_tricks.py -> build/lib.macosx-10.8-x86_64-2.7/numpy/lib
copying numpy/lib/twodim_base.py -> build/lib.macosx-10.8-x86_64-2.7/numpy/lib
copying numpy/lib/type_check.py -> build/lib.macosx-10.8-x86_64-2.7/numpy/lib
copying numpy/lib/ufunclike.py -> build/lib.macosx-10.8-x86_64-2.7/numpy/lib
copying numpy/lib/user_array.py -> build/lib.macosx-10.8-x86_64-2.7/numpy/lib
copying numpy/lib/utils.py -> build/lib.macosx-10.8-x86_64-2.7/numpy/lib
creating build/lib.macosx-10.8-x86_64-2.7/numpy/oldnumeric
copying numpy/oldnumeric/__init__.py -> build/lib.macosx-10.8-x86_64-2.7/numpy/oldnumeric
copying numpy/oldnumeric/alter_code1.py -> build/lib.macosx-10.8-x86_64-2.7/numpy/oldnumeric
copying numpy/oldnumeric/alter_code2.py -> build/lib.macosx-10.8-x86_64-2.7/numpy/oldnumeric
copying numpy/oldnumeric/array_printer.py -> build/lib.macosx-10.8-x86_64-2.7/numpy/oldnumeric
copying numpy/oldnumeric/arrayfns.py -> build/lib.macosx-10.8-x86_64-2.7/numpy/oldnumeric
copying numpy/oldnumeric/compat.py -> build/lib.macosx-10.8-x86_64-2.7/numpy/oldnumeric
copying numpy/oldnumeric/fft.py -> build/lib.macosx-10.8-x86_64-2.7/numpy/oldnumeric
copying numpy/oldnumeric/fix_default_axis.py -> build/lib.macosx-10.8-x86_64-2.7/numpy/oldnumeric
copying numpy/oldnumeric/functions.py -> build/lib.macosx-10.8-x86_64-2.7/numpy/oldnumeric
copying numpy/oldnumeric/linear_algebra.py -> build/lib.macosx-10.8-x86_64-2.7/numpy/oldnumeric
copying numpy/oldnumeric/ma.py -> build/lib.macosx-10.8-x86_64-2.7/numpy/oldnumeric
copying numpy/oldnumeric/matrix.py -> build/lib.macosx-10.8-x86_64-2.7/numpy/oldnumeric
copying numpy/oldnumeric/misc.py -> build/lib.macosx-10.8-x86_64-2.7/numpy/oldnumeric
copying numpy/oldnumeric/mlab.py -> build/lib.macosx-10.8-x86_64-2.7/numpy/oldnumeric
copying numpy/oldnumeric/precision.py -> build/lib.macosx-10.8-x86_64-2.7/numpy/oldnumeric
copying numpy/oldnumeric/random_array.py -> build/lib.macosx-10.8-x86_64-2.7/numpy/oldnumeric
copying numpy/oldnumeric/rng.py -> build/lib.macosx-10.8-x86_64-2.7/numpy/oldnumeric
copying numpy/oldnumeric/rng_stats.py -> build/lib.macosx-10.8-x86_64-2.7/numpy/oldnumeric
copying numpy/oldnumeric/setup.py -> build/lib.macosx-10.8-x86_64-2.7/numpy/oldnumeric
copying numpy/oldnumeric/typeconv.py -> build/lib.macosx-10.8-x86_64-2.7/numpy/oldnumeric
copying numpy/oldnumeric/ufuncs.py -> build/lib.macosx-10.8-x86_64-2.7/numpy/oldnumeric
copying numpy/oldnumeric/user_array.py -> build/lib.macosx-10.8-x86_64-2.7/numpy/oldnumeric
creating build/lib.macosx-10.8-x86_64-2.7/numpy/numarray
copying numpy/numarray/__init__.py -> build/lib.macosx-10.8-x86_64-2.7/numpy/numarray
copying numpy/numarray/alter_code1.py -> build/lib.macosx-10.8-x86_64-2.7/numpy/numarray
copying numpy/numarray/alter_code2.py -> build/lib.macosx-10.8-x86_64-2.7/numpy/numarray
copying numpy/numarray/compat.py -> build/lib.macosx-10.8-x86_64-2.7/numpy/numarray
copying numpy/numarray/convolve.py -> build/lib.macosx-10.8-x86_64-2.7/numpy/numarray
copying numpy/numarray/fft.py -> build/lib.macosx-10.8-x86_64-2.7/numpy/numarray
copying numpy/numarray/functions.py -> build/lib.macosx-10.8-x86_64-2.7/numpy/numarray
copying numpy/numarray/image.py -> build/lib.macosx-10.8-x86_64-2.7/numpy/numarray
copying numpy/numarray/linear_algebra.py -> build/lib.macosx-10.8-x86_64-2.7/numpy/numarray
copying numpy/numarray/ma.py -> build/lib.macosx-10.8-x86_64-2.7/numpy/numarray
copying numpy/numarray/matrix.py -> build/lib.macosx-10.8-x86_64-2.7/numpy/numarray
copying numpy/numarray/mlab.py -> build/lib.macosx-10.8-x86_64-2.7/numpy/numarray
copying numpy/numarray/nd_image.py -> build/lib.macosx-10.8-x86_64-2.7/numpy/numarray
copying numpy/numarray/numerictypes.py -> build/lib.macosx-10.8-x86_64-2.7/numpy/numarray
copying numpy/numarray/random_array.py -> build/lib.macosx-10.8-x86_64-2.7/numpy/numarray
copying numpy/numarray/session.py -> build/lib.macosx-10.8-x86_64-2.7/numpy/numarray
copying numpy/numarray/setup.py -> build/lib.macosx-10.8-x86_64-2.7/numpy/numarray
copying numpy/numarray/ufuncs.py -> build/lib.macosx-10.8-x86_64-2.7/numpy/numarray
copying numpy/numarray/util.py -> build/lib.macosx-10.8-x86_64-2.7/numpy/numarray
creating build/lib.macosx-10.8-x86_64-2.7/numpy/fft
copying numpy/fft/__init__.py -> build/lib.macosx-10.8-x86_64-2.7/numpy/fft
copying numpy/fft/fftpack.py -> build/lib.macosx-10.8-x86_64-2.7/numpy/fft
copying numpy/fft/fftpack_lite.py -> build/lib.macosx-10.8-x86_64-2.7/numpy/fft
copying numpy/fft/helper.py -> build/lib.macosx-10.8-x86_64-2.7/numpy/fft
copying numpy/fft/info.py -> build/lib.macosx-10.8-x86_64-2.7/numpy/fft
copying numpy/fft/setup.py -> build/lib.macosx-10.8-x86_64-2.7/numpy/fft
creating build/lib.macosx-10.8-x86_64-2.7/numpy/linalg
copying numpy/linalg/__init__.py -> build/lib.macosx-10.8-x86_64-2.7/numpy/linalg
copying numpy/linalg/_umath_linalg.py -> build/lib.macosx-10.8-x86_64-2.7/numpy/linalg
copying numpy/linalg/info.py -> build/lib.macosx-10.8-x86_64-2.7/numpy/linalg
copying numpy/linalg/linalg.py -> build/lib.macosx-10.8-x86_64-2.7/numpy/linalg
copying numpy/linalg/setup.py -> build/lib.macosx-10.8-x86_64-2.7/numpy/linalg
creating build/lib.macosx-10.8-x86_64-2.7/numpy/random
copying numpy/random/__init__.py -> build/lib.macosx-10.8-x86_64-2.7/numpy/random
copying numpy/random/info.py -> build/lib.macosx-10.8-x86_64-2.7/numpy/random
copying numpy/random/mtrand.py -> build/lib.macosx-10.8-x86_64-2.7/numpy/random
copying numpy/random/setup.py -> build/lib.macosx-10.8-x86_64-2.7/numpy/random
creating build/lib.macosx-10.8-x86_64-2.7/numpy/ma
copying numpy/ma/__init__.py -> build/lib.macosx-10.8-x86_64-2.7/numpy/ma
copying numpy/ma/bench.py -> build/lib.macosx-10.8-x86_64-2.7/numpy/ma
copying numpy/ma/core.py -> build/lib.macosx-10.8-x86_64-2.7/numpy/ma
copying numpy/ma/extras.py -> build/lib.macosx-10.8-x86_64-2.7/numpy/ma
copying numpy/ma/mrecords.py -> build/lib.macosx-10.8-x86_64-2.7/numpy/ma
copying numpy/ma/setup.py -> build/lib.macosx-10.8-x86_64-2.7/numpy/ma
copying numpy/ma/testutils.py -> build/lib.macosx-10.8-x86_64-2.7/numpy/ma
copying numpy/ma/timer_comparison.py -> build/lib.macosx-10.8-x86_64-2.7/numpy/ma
copying numpy/ma/version.py -> build/lib.macosx-10.8-x86_64-2.7/numpy/ma
creating build/lib.macosx-10.8-x86_64-2.7/numpy/matrixlib
copying numpy/matrixlib/__init__.py -> build/lib.macosx-10.8-x86_64-2.7/numpy/matrixlib
copying numpy/matrixlib/defmatrix.py -> build/lib.macosx-10.8-x86_64-2.7/numpy/matrixlib
copying numpy/matrixlib/setup.py -> build/lib.macosx-10.8-x86_64-2.7/numpy/matrixlib
creating build/lib.macosx-10.8-x86_64-2.7/numpy/compat
copying numpy/compat/__init__.py -> build/lib.macosx-10.8-x86_64-2.7/numpy/compat
copying numpy/compat/_inspect.py -> build/lib.macosx-10.8-x86_64-2.7/numpy/compat
copying numpy/compat/py3k.py -> build/lib.macosx-10.8-x86_64-2.7/numpy/compat
copying numpy/compat/setup.py -> build/lib.macosx-10.8-x86_64-2.7/numpy/compat
creating build/lib.macosx-10.8-x86_64-2.7/numpy/polynomial
copying numpy/polynomial/__init__.py -> build/lib.macosx-10.8-x86_64-2.7/numpy/polynomial
copying numpy/polynomial/chebyshev.py -> build/lib.macosx-10.8-x86_64-2.7/numpy/polynomial
copying numpy/polynomial/hermite.py -> build/lib.macosx-10.8-x86_64-2.7/numpy/polynomial
copying numpy/polynomial/hermite_e.py -> build/lib.macosx-10.8-x86_64-2.7/numpy/polynomial
copying numpy/polynomial/laguerre.py -> build/lib.macosx-10.8-x86_64-2.7/numpy/polynomial
copying numpy/polynomial/legendre.py -> build/lib.macosx-10.8-x86_64-2.7/numpy/polynomial
copying numpy/polynomial/polynomial.py -> build/lib.macosx-10.8-x86_64-2.7/numpy/polynomial
copying numpy/polynomial/polytemplate.py -> build/lib.macosx-10.8-x86_64-2.7/numpy/polynomial
copying numpy/polynomial/polyutils.py -> build/lib.macosx-10.8-x86_64-2.7/numpy/polynomial
copying numpy/polynomial/setup.py -> build/lib.macosx-10.8-x86_64-2.7/numpy/polynomial
creating build/lib.macosx-10.8-x86_64-2.7/numpy/doc
copying numpy/doc/__init__.py -> build/lib.macosx-10.8-x86_64-2.7/numpy/doc
copying numpy/doc/basics.py -> build/lib.macosx-10.8-x86_64-2.7/numpy/doc
copying numpy/doc/broadcasting.py -> build/lib.macosx-10.8-x86_64-2.7/numpy/doc
copying numpy/doc/byteswapping.py -> build/lib.macosx-10.8-x86_64-2.7/numpy/doc
copying numpy/doc/constants.py -> build/lib.macosx-10.8-x86_64-2.7/numpy/doc
copying numpy/doc/creation.py -> build/lib.macosx-10.8-x86_64-2.7/numpy/doc
copying numpy/doc/glossary.py -> build/lib.macosx-10.8-x86_64-2.7/numpy/doc
copying numpy/doc/howtofind.py -> build/lib.macosx-10.8-x86_64-2.7/numpy/doc
copying numpy/doc/indexing.py -> build/lib.macosx-10.8-x86_64-2.7/numpy/doc
copying numpy/doc/internals.py -> build/lib.macosx-10.8-x86_64-2.7/numpy/doc
copying numpy/doc/io.py -> build/lib.macosx-10.8-x86_64-2.7/numpy/doc
copying numpy/doc/jargon.py -> build/lib.macosx-10.8-x86_64-2.7/numpy/doc
copying numpy/doc/methods_vs_functions.py -> build/lib.macosx-10.8-x86_64-2.7/numpy/doc
copying numpy/doc/misc.py -> build/lib.macosx-10.8-x86_64-2.7/numpy/doc
copying numpy/doc/performance.py -> build/lib.macosx-10.8-x86_64-2.7/numpy/doc
copying numpy/doc/structured_arrays.py -> build/lib.macosx-10.8-x86_64-2.7/numpy/doc
copying numpy/doc/subclassing.py -> build/lib.macosx-10.8-x86_64-2.7/numpy/doc
copying numpy/doc/ufuncs.py -> build/lib.macosx-10.8-x86_64-2.7/numpy/doc
running build_clib
customize UnixCCompiler
customize UnixCCompiler using build_clib
building 'npymath' library
compiling C sources
C compiler: cc -arch x86_64 -O2 -fPIC -Wimplicit -O2 -fPIC -Wimplicit -O2 -fPIC -Wimplicit -O2 -fPIC -Wimplicit

creating build/temp.macosx-10.8-x86_64-2.7
creating build/temp.macosx-10.8-x86_64-2.7/build
creating build/temp.macosx-10.8-x86_64-2.7/build/src.macosx-10.8-x86_64-2.7
creating build/temp.macosx-10.8-x86_64-2.7/build/src.macosx-10.8-x86_64-2.7/numpy
creating build/temp.macosx-10.8-x86_64-2.7/build/src.macosx-10.8-x86_64-2.7/numpy/core
creating build/temp.macosx-10.8-x86_64-2.7/build/src.macosx-10.8-x86_64-2.7/numpy/core/src
creating build/temp.macosx-10.8-x86_64-2.7/build/src.macosx-10.8-x86_64-2.7/numpy/core/src/npymath
creating build/temp.macosx-10.8-x86_64-2.7/numpy
creating build/temp.macosx-10.8-x86_64-2.7/numpy/core
creating build/temp.macosx-10.8-x86_64-2.7/numpy/core/src
creating build/temp.macosx-10.8-x86_64-2.7/numpy/core/src/npymath
compile options: '-Inumpy/core/include -Ibuild/src.macosx-10.8-x86_64-2.7/numpy/core/include/numpy -Inumpy/core/src/private -Inumpy/core/src -Inumpy/core -Inumpy/core/src/npymath -Inumpy/core/src/multiarray -Inumpy/core/src/umath -Inumpy/core/src/npysort -Inumpy/core/include -I/opt/pypy-2.2-osx64/include -c'
cc: build/src.macosx-10.8-x86_64-2.7/numpy/core/src/npymath/npy_math.c
cc: build/src.macosx-10.8-x86_64-2.7/numpy/core/src/npymath/ieee754.c
cc: numpy/core/src/npymath/halffloat.c
cc: build/src.macosx-10.8-x86_64-2.7/numpy/core/src/npymath/npy_math_complex.c
ar: adding 4 object files to build/temp.macosx-10.8-x86_64-2.7/libnpymath.a
ranlib:@ build/temp.macosx-10.8-x86_64-2.7/libnpymath.a
building 'npysort' library
compiling C sources
C compiler: cc -arch x86_64 -O2 -fPIC -Wimplicit -O2 -fPIC -Wimplicit -O2 -fPIC -Wimplicit -O2 -fPIC -Wimplicit

creating build/temp.macosx-10.8-x86_64-2.7/build/src.macosx-10.8-x86_64-2.7/numpy/core/src/npysort
compile options: '-Inumpy/core/include -Ibuild/src.macosx-10.8-x86_64-2.7/numpy/core/include/numpy -Inumpy/core/src/private -Inumpy/core/src -Inumpy/core -Inumpy/core/src/npymath -Inumpy/core/src/multiarray -Inumpy/core/src/umath -Inumpy/core/src/npysort -Inumpy/core/include -I/opt/pypy-2.2-osx64/include -c'
cc: build/src.macosx-10.8-x86_64-2.7/numpy/core/src/npysort/quicksort.c
cc: build/src.macosx-10.8-x86_64-2.7/numpy/core/src/npysort/mergesort.c
cc: build/src.macosx-10.8-x86_64-2.7/numpy/core/src/npysort/heapsort.c
cc: build/src.macosx-10.8-x86_64-2.7/numpy/core/src/npysort/selection.c
ar: adding 4 object files to build/temp.macosx-10.8-x86_64-2.7/libnpysort.a
ranlib:@ build/temp.macosx-10.8-x86_64-2.7/libnpysort.a
running build_ext
customize UnixCCompiler
customize UnixCCompiler using build_ext
customize Gnu95FCompiler
customize Gnu95FCompiler
customize Gnu95FCompiler using build_ext
building 'numpy.core._dummy' extension
compiling C sources
C compiler: cc -arch x86_64 -O2 -fPIC -Wimplicit -O2 -fPIC -Wimplicit -O2 -fPIC -Wimplicit -O2 -fPIC -Wimplicit -O2 -fPIC -Wimplicit

compile options: '-DHAVE_NPY_CONFIG_H=1 -Inumpy/core/include -Ibuild/src.macosx-10.8-x86_64-2.7/numpy/core/include/numpy -Inumpy/core/src/private -Inumpy/core/src -Inumpy/core -Inumpy/core/src/npymath -Inumpy/core/src/multiarray -Inumpy/core/src/umath -Inumpy/core/src/npysort -Inumpy/core/include -I/opt/pypy-2.2-osx64/include -c'
cc: numpy/core/src/dummymodule.c
In file included from numpy/core/src/dummymodule.c:11:
In file included from numpy/core/src/private/npy_pycompat.h:4:
numpy/core/include/numpy/npy_3kcompat.h:125:14: warning: implicit declaration of function 'PyUnicode_Concat' is invalid in C99 [-Wimplicit-function-declaration]
    newobj = PyUnicode_Concat(*left, right);
             ^
numpy/core/include/numpy/npy_3kcompat.h:125:12: warning: incompatible integer to pointer conversion assigning to 'PyObject *' (aka 'struct _object *') from 'int'; 
    newobj = PyUnicode_Concat(*left, right);
           ^ ~~~~~~~~~~~~~~~~~~~~~~~~~~~~~~
numpy/core/include/numpy/npy_3kcompat.h:135:12: warning: incompatible integer to pointer conversion assigning to 'PyObject *' (aka 'struct _object *') from 'int'; 
    newobj = PyUnicode_Concat(*left, right);
           ^ ~~~~~~~~~~~~~~~~~~~~~~~~~~~~~~
3 warnings generated.
cc -shared -undefined dynamic_lookup -arch x86_64 build/temp.macosx-10.8-x86_64-2.7/numpy/core/src/dummymodule.o -Lbuild/temp.macosx-10.8-x86_64-2.7 -o build/lib.macosx-10.8-x86_64-2.7/numpy/core/_dummy.pypy-22.so
building 'numpy.linalg.lapack_lite' extension
compiling C sources
C compiler: cc -arch x86_64 -O2 -fPIC -Wimplicit -O2 -fPIC -Wimplicit -O2 -fPIC -Wimplicit -O2 -fPIC -Wimplicit -O2 -fPIC -Wimplicit

creating build/temp.macosx-10.8-x86_64-2.7/numpy/linalg
creating build/temp.macosx-10.8-x86_64-2.7/numpy/linalg/lapack_lite
compile options: '-DATLAS_INFO="\"3.10.0\"" -I/opt/local/include -Inumpy/core/include -Ibuild/src.macosx-10.8-x86_64-2.7/numpy/core/include/numpy -Inumpy/core/src/private -Inumpy/core/src -Inumpy/core -Inumpy/core/src/npymath -Inumpy/core/src/multiarray -Inumpy/core/src/umath -Inumpy/core/src/npysort -Inumpy/core/include -I/opt/pypy-2.2-osx64/include -c'
cc: numpy/linalg/lapack_lite/python_xerbla.c
cc: numpy/linalg/lapack_litemodule.c
/usr/local/bin/gfortran -Wall -Wall -undefined dynamic_lookup -bundle build/temp.macosx-10.8-x86_64-2.7/numpy/linalg/lapack_litemodule.o build/temp.macosx-10.8-x86_64-2.7/numpy/linalg/lapack_lite/python_xerbla.o -L/opt/local/lib -L/usr/local/lib/gcc/i686-apple-darwin8/4.2.3 -Lbuild/temp.macosx-10.8-x86_64-2.7 -llapack -lptf77blas -lptcblas -latlas -lgfortran -o build/lib.macosx-10.8-x86_64-2.7/numpy/linalg/lapack_lite.pypy-22.so
ld: warning: ld: warning: ld: warning: ld: warning: ignoring file build/temp.macosx-10.8-x86_64-2.7/numpy/linalg/lapack_litemodule.o, file was built for unsupported file format ( 0xcf 0xfa 0xed 0xfe 0x 7 0x 0 0x 0 0x 1 0x 3 0x 0 0x 0 0x 0 0x 1 0x 0 0x 0 0x 0 ) which is not the architecture being linked (i386): build/temp.macosx-10.8-x86_64-2.7/numpy/linalg/lapack_litemodule.oignoring file build/temp.macosx-10.8-x86_64-2.7/numpy/linalg/lapack_lite/python_xerbla.o, file was built for unsupported file format ( 0xcf 0xfa 0xed 0xfe 0x 7 0x 0 0x 0 0x 1 0x 3 0x 0 0x 0 0x 0 0x 1 0x 0 0x 0 0x 0 ) which is not the architecture being linked (i386): build/temp.macosx-10.8-x86_64-2.7/numpy/linalg/lapack_lite/python_xerbla.oignoring file /opt/local/lib/liblapack.a, file was built for archive which is not the architecture being linked (i386): /opt/local/lib/liblapack.aignoring file /opt/local/lib/libptf77blas.a, file was built for archive which is not the architecture being linked (i386): /
 opt/local/lib/libptf77blas.a



ld: warning: ignoring file /opt/local/lib/libptcblas.a, file was built for archive which is not the architecture being linked (i386): /opt/local/lib/libptcblas.a
ld: warning: ignoring file /opt/local/lib/libatlas.a, file was built for archive which is not the architecture being linked (i386): /opt/local/lib/libatlas.a
running build_scripts
creating build/scripts.macosx-10.8-x86_64-2.7
Creating build/scripts.macosx-10.8-x86_64-2.7/f2py
  adding 'build/scripts.macosx-10.8-x86_64-2.7/f2py' to scripts
changing mode of build/scripts.macosx-10.8-x86_64-2.7/f2py from 644 to 755


More information about the pypy-issue mailing list