[Python-3000-checkins] Python Regression Test Failures all (1)

Neal Norwitz nnorwitz at gmail.com
Tue May 15 03:59:22 CEST 2007


test_grammar
test_opcodes
test_dict
test_builtin
test_exceptions
test_types
test_unittest
test_doctest
test_doctest2
test_MimeWriter
test_StringIO
test___all__
test___future__
test__locale
test_aepack
test_aepack skipped -- No module named aepack
test_anydbm
test_applesingle
test_applesingle skipped -- No module named macostools
test_array
test_ast
test_asynchat
test_atexit
test_audioop
test_augassign
test_base64
test_bigaddrspace
test_bigmem
test_binascii
test_binhex
test_binop
test_bisect
test_bool
test_bsddb
test_bsddb3
Exception in thread reader 1:
Traceback (most recent call last):
  File "/tmp/python-test-3.0/local/lib/python3.0/threading.py", line 459, in __bootstrap
    self.run()
  File "/tmp/python-test-3.0/local/lib/python3.0/threading.py", line 439, in run
    self.__target(*self.__args, **self.__kwargs)
  File "/tmp/python-test-3.0/local/lib/python3.0/bsddb/test/test_thread.py", line 281, in readerThread
    rec = dbutils.DeadlockWrap(c.next, max_retries=10)
  File "/tmp/python-test-3.0/local/lib/python3.0/bsddb/dbutils.py", line 62, in DeadlockWrap
    return function(*_args, **_kwargs)
bsddb.db.DBLockDeadlockError: (-30996, 'DB_LOCK_DEADLOCK: Locker killed to resolve a deadlock')

Exception in thread reader 0:
Traceback (most recent call last):
  File "/tmp/python-test-3.0/local/lib/python3.0/threading.py", line 459, in __bootstrap
    self.run()
  File "/tmp/python-test-3.0/local/lib/python3.0/threading.py", line 439, in run
    self.__target(*self.__args, **self.__kwargs)
  File "/tmp/python-test-3.0/local/lib/python3.0/bsddb/test/test_thread.py", line 281, in readerThread
    rec = dbutils.DeadlockWrap(c.next, max_retries=10)
  File "/tmp/python-test-3.0/local/lib/python3.0/bsddb/dbutils.py", line 62, in DeadlockWrap
    return function(*_args, **_kwargs)
bsddb.db.DBLockDeadlockError: (-30996, 'DB_LOCK_DEADLOCK: Locker killed to resolve a deadlock')

Exception in thread reader 2:
Traceback (most recent call last):
  File "/tmp/python-test-3.0/local/lib/python3.0/threading.py", line 459, in __bootstrap
    self.run()
  File "/tmp/python-test-3.0/local/lib/python3.0/threading.py", line 439, in run
    self.__target(*self.__args, **self.__kwargs)
  File "/tmp/python-test-3.0/local/lib/python3.0/bsddb/test/test_thread.py", line 281, in readerThread
    rec = dbutils.DeadlockWrap(c.next, max_retries=10)
  File "/tmp/python-test-3.0/local/lib/python3.0/bsddb/dbutils.py", line 62, in DeadlockWrap
    return function(*_args, **_kwargs)
bsddb.db.DBLockDeadlockError: (-30996, 'DB_LOCK_DEADLOCK: Locker killed to resolve a deadlock')

Exception in thread reader 3:
Traceback (most recent call last):
  File "/tmp/python-test-3.0/local/lib/python3.0/threading.py", line 459, in __bootstrap
    self.run()
  File "/tmp/python-test-3.0/local/lib/python3.0/threading.py", line 439, in run
    self.__target(*self.__args, **self.__kwargs)
  File "/tmp/python-test-3.0/local/lib/python3.0/bsddb/test/test_thread.py", line 281, in readerThread
    rec = dbutils.DeadlockWrap(c.next, max_retries=10)
  File "/tmp/python-test-3.0/local/lib/python3.0/bsddb/dbutils.py", line 62, in DeadlockWrap
    return function(*_args, **_kwargs)
bsddb.db.DBLockDeadlockError: (-30996, 'DB_LOCK_DEADLOCK: Locker killed to resolve a deadlock')

test_buffer
test_bufio
test_bytes
test_bz2
test_cProfile
test_calendar
test_call
test_capi
test_cfgparser
test_cgi
test_charmapcodec
test_class
test_cmath
test_cmd_line
test_code
test_codeccallbacks
test_codecencodings_cn
test_codecencodings_hk
test_codecencodings_jp
test_codecencodings_kr
test_codecencodings_tw
test_codecmaps_cn
test_codecmaps_hk
test_codecmaps_jp
test_codecmaps_kr
test_codecmaps_tw
test_codecs
test_codeop
test_coding
test_collections
test_colorsys
test_commands
test_compare
test_compile
test_complex
test_contains
test_contextlib
test_cookie
test_cookielib
test_copy
test_copy_reg
test_cpickle
test_crypt
test_csv
test_ctypes
test_datetime
test_dbm
test_decimal
test_decorators
test_defaultdict
test_deque
test_descr
test_descrtut
test_dictviews
test_difflib
test_dircache
test_dis
test_distutils
test_dl
test_dumbdbm
test_dummy_thread
test_dummy_threading
test_email
test_email_codecs
test_email_renamed
test_enumerate
test_eof
test_errno
test_exception_variations
test_extcall
test_fcntl
test_file
test_filecmp
test_fileinput
test_fileio
test_float
test_fnmatch
test_fork1
test_format
test_fpformat
test_frozen
test_ftplib
test_funcattrs
test_functools
test_future
test_gc
test_gdbm
test_generators
test_genericpath
test_genexps
test_getargs
test_getargs2
test_getopt
test_gettext
test_glob
test_global
test_grp
test_gzip
test_hash
test_hashlib
test_heapq
test_hexoct
test_hmac
test_hotshot
test_htmllib
test_htmlparser
test_httplib
test_imageop
test_imaplib
test_imp
test_import
test_importhooks
test_index
test_inspect
test_io
test_ioctl
test_ioctl skipped -- Unable to open /dev/tty
test_isinstance
test_iter
test_iterlen
test_itertools
test_keywordonlyarg
test_largefile
test_list
test_listcomps
test_locale
test_logging
test_long
test_long_future
test_longexp
test_macfs
test_macfs skipped -- No module named macfs
test_macostools
test_macostools skipped -- No module named macostools
test_macpath
test_mailbox
test_marshal
test_math
test_metaclass
test_mhlib
test_mimetools
test_mimetypes
test_minidom
test_mmap
test_module
test_modulefinder
test_multibytecodec
test_multibytecodec_support
test_multifile
test_mutants
test_netrc
test_new
test_nis
test_normalization
test_ntpath
test_old_mailbox
test_openpty
test_operator
test_optparse
test_os
test_parser
test_peepholer
test_pep247
test_pep263
test_pep277
test_pep277 skipped -- test works only on NT+
test_pep292
test_pep352
test_pickle
test_pickletools
test_pkg
test_pkgimport
test_platform
test_plistlib
test_plistlib skipped -- No module named plistlib
test_poll
test_popen
[10451 refs]
[10451 refs]
[10451 refs]
test_popen2
test test_popen2 failed -- errors occurred; run in verbose mode for details
test_poplib
test_posix
test_posixpath
test_pow
test_pprint
test_profile
test_profilehooks
test_pty
test_pwd
test_pyclbr
test_pyexpat
test_queue
test_quopri
[11308 refs]
[11308 refs]
test_random
test_re
test_repr
test_resource
test_rfc822
test_rgbimg
test_richcmp
test_robotparser
test_runpy
test_sax
test_scope
test_scriptpackages
test_scriptpackages skipped -- No module named aetools
test_select
test_set
test_setcomps
test_sgmllib
test_shelve
test_shlex
test_shutil
test_signal
test_site
test_slice
test_smtplib
test_socket
test_socket_ssl
test_socketserver
test_sort
test_sqlite
test_startfile
test_startfile skipped -- cannot import name startfile
test_str
test_strftime
test_string
test_stringprep
test_strop
test_strptime
test_struct
test_structmembers
test_structseq
test_subprocess
[10445 refs]
[10443 refs]
[10445 refs]
[10445 refs]
[10445 refs]
[10445 refs]
[10445 refs]
[10445 refs]
[10445 refs]
[10445 refs]
[10443 refs]
[13640 refs]
[10661 refs]
[10446 refs]
[10446 refs]
[10445 refs]
[10445 refs]
[10445 refs]
[10445 refs]
.
[10445 refs]
[10445 refs]
    this bit of output is from a test of stdout in a different process ...
[10445 refs]
[10445 refs]
[10661 refs]
test_sunaudiodev
test_sunaudiodev skipped -- No module named sunaudiodev
test_sundry
test_symtable
test_syntax
test_sys
[10445 refs]
[10445 refs]
test_tarfile
test_tcl
test_tcl skipped -- No module named _tkinter
test_telnetlib
test_tempfile
[10450 refs]
test_textwrap
test_thread
test_threaded_import
test_threadedtempfile
test_threading
test_threading_local
test_threadsignals
test_time
test_timeout
test_tokenize
test_trace
test_traceback
test_tuple
test_ucn
test_unary
test_unicode
test_unicode_file
test_unicode_file skipped -- No Unicode filesystem semantics on this platform.
test_unicodedata
test_univnewlines
test_unpack
test_unpack_ex
test_urllib
test_urllib2
test_urllib2net
test_urllibnet
test_urlparse
test_userdict
test_userlist
test_userstring
test_uu
test_uuid
    WARNING: uuid.getnode is unreliable on many platforms.
        It is disabled until the code and/or test can be fixed properly.
    WARNING: uuid._ifconfig_getnode is unreliable on many platforms.
        It is disabled until the code and/or test can be fixed properly.
    WARNING: uuid._unixdll_getnode is unreliable on many platforms.
        It is disabled until the code and/or test can be fixed properly.
test_wait3
test_wait4
test_warnings
test_wave
test_weakref
test_whichdb
test_winreg
test_winreg skipped -- No module named _winreg
test_winsound
test_winsound skipped -- No module named winsound
test_with
test_wsgiref
test_xdrlib
test_xml_etree
test_xml_etree_c
test_xmlrpc
test_xpickle
test_xrange
test_zipfile
test_zipfile64
test_zipfile64 skipped -- test requires loads of disk-space bytes and a long time to run
test_zipimport
test_zlib
302 tests OK.
1 test failed:
    test_popen2
15 tests skipped:
    test_aepack test_applesingle test_ioctl test_macfs test_macostools
    test_pep277 test_plistlib test_scriptpackages test_startfile
    test_sunaudiodev test_tcl test_unicode_file test_winreg
    test_winsound test_zipfile64
2 skips unexpected on linux2:
    test_tcl test_ioctl
[625557 refs]


More information about the Python-3000-checkins mailing list