[Python-checkins] buildbot failure in g4 osx.4 3.0

buildbot at python.org buildbot at python.org
Mon Dec 31 18:44:07 CET 2007


The Buildbot has detected a new failure of g4 osx.4 3.0.
Full details are available at:
 http://www.python.org/dev/buildbot/all/g4%20osx.4%203.0/builds/393

Buildbot URL: http://www.python.org/dev/buildbot/all/

Buildslave for this Build: psf-g4

Build Reason: 
Build Source Stamp: [branch branches/py3k] HEAD
Blamelist: christian.heimes

BUILD FAILED: failed test

Excerpt from the test logfile:
Traceback (most recent call last):
  File "/Users/buildslave/bb/3.0.psf-g4/build/Lib/threading.py", line 485, in _bootstrap_inner
    self.run()
  File "/Users/buildslave/bb/3.0.psf-g4/build/Lib/threading.py", line 445, in run
    self._target(*self._args, **self._kwargs)
  File "/Users/buildslave/bb/3.0.psf-g4/build/Lib/bsddb/test/test_thread.py", line 80, in writerThread
    self._writerThread(*args, **kwargs)
  File "/Users/buildslave/bb/3.0.psf-g4/build/Lib/bsddb/test/test_thread.py", line 269, in _writerThread
    self.assertEqual(data, self.makeData(key))
  File "/Users/buildslave/bb/3.0.psf-g4/build/Lib/unittest.py", line 325, in failUnlessEqual
    raise self.failureException(msg or '%r != %r' % (first, second))
AssertionError: None != b'0003-0003-0003-0003-0003'

Traceback (most recent call last):
  File "/Users/buildslave/bb/3.0.psf-g4/build/Lib/threading.py", line 485, in _bootstrap_inner
    self.run()
  File "/Users/buildslave/bb/3.0.psf-g4/build/Lib/threading.py", line 445, in run
    self._target(*self._args, **self._kwargs)
  File "/Users/buildslave/bb/3.0.psf-g4/build/Lib/bsddb/test/test_thread.py", line 80, in writerThread
    self._writerThread(*args, **kwargs)
  File "/Users/buildslave/bb/3.0.psf-g4/build/Lib/bsddb/test/test_thread.py", line 269, in _writerThread
    self.assertEqual(data, self.makeData(key))
  File "/Users/buildslave/bb/3.0.psf-g4/build/Lib/unittest.py", line 325, in failUnlessEqual
    raise self.failureException(msg or '%r != %r' % (first, second))
AssertionError: None != b'1000-1000-1000-1000-1000'

Traceback (most recent call last):
  File "/Users/buildslave/bb/3.0.psf-g4/build/Lib/threading.py", line 485, in _bootstrap_inner
    self.run()
  File "/Users/buildslave/bb/3.0.psf-g4/build/Lib/threading.py", line 445, in run
    self._target(*self._args, **self._kwargs)
  File "/Users/buildslave/bb/3.0.psf-g4/build/Lib/bsddb/test/test_thread.py", line 80, in writerThread
    self._writerThread(*args, **kwargs)
  File "/Users/buildslave/bb/3.0.psf-g4/build/Lib/bsddb/test/test_thread.py", line 269, in _writerThread
    self.assertEqual(data, self.makeData(key))
  File "/Users/buildslave/bb/3.0.psf-g4/build/Lib/unittest.py", line 325, in failUnlessEqual
    raise self.failureException(msg or '%r != %r' % (first, second))
AssertionError: None != b'2001-2001-2001-2001-2001'

1 test failed:
    test_richcmp

======================================================================
FAIL: test_simpleOrderHashable (test.test_richcmp.HashableTest)
----------------------------------------------------------------------

Traceback (most recent call last):
  File "/Users/buildslave/bb/3.0.psf-g4/build/Lib/test/test_richcmp.py", line 376, in test_simpleOrderHashable
    self.assert_(a.__hash__ is not None)
AssertionError: None

make: *** [buildbottest] Error 1

sincerely,
 -The Buildbot



More information about the Python-checkins mailing list