[Python-checkins] buildbot warnings in amd64 gentoo trunk

buildbot at python.org buildbot at python.org
Wed Jun 13 19:24:35 CEST 2007


The Buildbot has detected a new failure of amd64 gentoo trunk.
Full details are available at:
 http://www.python.org/dev/buildbot/all/amd64%2520gentoo%2520trunk/builds/2123

Buildbot URL: http://www.python.org/dev/buildbot/all/

Build Reason: 
Build Source Stamp: [branch trunk] HEAD
Blamelist: walter.doerwald

Build had warnings: warnings test

Excerpt from the test logfile:
Traceback (most recent call last):
  File "/home/buildbot/slave/py-build/trunk.norwitz-amd64/build/Lib/threading.py", line 465, in __bootstrap
    self.run()
  File "/home/buildbot/slave/py-build/trunk.norwitz-amd64/build/Lib/test/test_socketserver.py", line 93, in run
    svr.serve_a_few()
  File "/home/buildbot/slave/py-build/trunk.norwitz-amd64/build/Lib/test/test_socketserver.py", line 35, in serve_a_few
    self.handle_request()
  File "/home/buildbot/slave/py-build/trunk.norwitz-amd64/build/Lib/SocketServer.py", line 224, in handle_request
    self.handle_error(request, client_address)
  File "/home/buildbot/slave/py-build/trunk.norwitz-amd64/build/Lib/SocketServer.py", line 222, in handle_request
    self.process_request(request, client_address)
  File "/home/buildbot/slave/py-build/trunk.norwitz-amd64/build/Lib/SocketServer.py", line 429, in process_request
    self.collect_children()
  File "/home/buildbot/slave/py-build/trunk.norwitz-amd64/build/Lib/SocketServer.py", line 425, in collect_children
    self.active_children.remove(pid)
ValueError: list.remove(x): x not in list

Traceback (most recent call last):
  File "/home/buildbot/slave/py-build/trunk.norwitz-amd64/build/Lib/threading.py", line 465, in __bootstrap
    self.run()
  File "/home/buildbot/slave/py-build/trunk.norwitz-amd64/build/Lib/threading.py", line 445, in run
    self.__target(*self.__args, **self.__kwargs)
  File "/home/buildbot/slave/py-build/trunk.norwitz-amd64/build/Lib/bsddb/test/test_thread.py", line 281, in readerThread
    rec = dbutils.DeadlockWrap(c.next, max_retries=10)
  File "/home/buildbot/slave/py-build/trunk.norwitz-amd64/build/Lib/bsddb/dbutils.py", line 62, in DeadlockWrap
    return function(*_args, **_kwargs)
DBLockDeadlockError: (-30995, 'DB_LOCK_DEADLOCK: Locker killed to resolve a deadlock')

Traceback (most recent call last):
  File "/home/buildbot/slave/py-build/trunk.norwitz-amd64/build/Lib/threading.py", line 465, in __bootstrap
    self.run()
  File "/home/buildbot/slave/py-build/trunk.norwitz-amd64/build/Lib/threading.py", line 445, in run
    self.__target(*self.__args, **self.__kwargs)
  File "/home/buildbot/slave/py-build/trunk.norwitz-amd64/build/Lib/bsddb/test/test_thread.py", line 281, in readerThread
    rec = dbutils.DeadlockWrap(c.next, max_retries=10)
  File "/home/buildbot/slave/py-build/trunk.norwitz-amd64/build/Lib/bsddb/dbutils.py", line 62, in DeadlockWrap
    return function(*_args, **_kwargs)
DBLockDeadlockError: (-30995, 'DB_LOCK_DEADLOCK: Locker killed to resolve a deadlock')

1 test failed:
    test_socketserver

make: *** [buildbottest] Error 1

sincerely,
 -The Buildbot



More information about the Python-checkins mailing list