[Python-checkins] buildbot failure in hppa Ubuntu 2.5

buildbot at python.org buildbot at python.org
Sat Nov 3 00:55:33 CET 2007


The Buildbot has detected a new failure of hppa Ubuntu 2.5.
Full details are available at:
 http://www.python.org/dev/buildbot/all/hppa%20Ubuntu%202.5/builds/65

Buildbot URL: http://www.python.org/dev/buildbot/all/

Buildslave for this Build: klose-ubuntu-hppa

Build Reason: 
Build Source Stamp: [branch branches/release25-maint] HEAD
Blamelist: georg.brandl

BUILD FAILED: failed test

Excerpt from the test logfile:
2 tests failed:
    test_bsddb3 test_resource

======================================================================
ERROR: test00_associateDBError (bsddb.test.test_associate.AssociateErrorTestCase)
----------------------------------------------------------------------

Traceback (most recent call last):
  File "/home/pybot/buildarea/2.5.klose-ubuntu-hppa/build/Lib/bsddb/test/test_associate.py", line 104, in setUp
    self.env.open(homeDir, db.DB_CREATE | db.DB_INIT_MPOOL)
DBInvalidArgError: (22, 'Invalid argument -- Berkeley DB library configured to support only private environments')

======================================================================
ERROR: test01_associateWithDB (bsddb.test.test_associate.AssociateHashTestCase)
----------------------------------------------------------------------

Traceback (most recent call last):
  File "/home/pybot/buildarea/2.5.klose-ubuntu-hppa/build/Lib/bsddb/test/test_associate.py", line 165, in setUp
    db.DB_INIT_LOCK | db.DB_THREAD | self.envFlags)
DBInvalidArgError: (22, 'Invalid argument -- Berkeley DB library configured to support only private environments')

======================================================================
ERROR: test02_associateAfterDB (bsddb.test.test_associate.AssociateHashTestCase)
----------------------------------------------------------------------

Traceback (most recent call last):
  File "/home/pybot/buildarea/2.5.klose-ubuntu-hppa/build/Lib/bsddb/test/test_associate.py", line 165, in setUp
    db.DB_INIT_LOCK | db.DB_THREAD | self.envFlags)
DBInvalidArgError: (22, 'Invalid argument -- Berkeley DB library configured to support only private environments')

======================================================================
ERROR: test01_associateWithDB (bsddb.test.test_associate.AssociateBTreeTestCase)
----------------------------------------------------------------------

Traceback (most recent call last):
  File "/home/pybot/buildarea/2.5.klose-ubuntu-hppa/build/Lib/bsddb/test/test_associate.py", line 165, in setUp
    db.DB_INIT_LOCK | db.DB_THREAD | self.envFlags)
DBInvalidArgError: (22, 'Invalid argument -- Berkeley DB library configured to support only private environments')

======================================================================
ERROR: test02_associateAfterDB (bsddb.test.test_associate.AssociateBTreeTestCase)
----------------------------------------------------------------------

Traceback (most recent call last):
  File "/home/pybot/buildarea/2.5.klose-ubuntu-hppa/build/Lib/bsddb/test/test_associate.py", line 165, in setUp
    db.DB_INIT_LOCK | db.DB_THREAD | self.envFlags)
DBInvalidArgError: (22, 'Invalid argument -- Berkeley DB library configured to support only private environments')

======================================================================
ERROR: test01_associateWithDB (bsddb.test.test_associate.AssociateRecnoTestCase)
----------------------------------------------------------------------

Traceback (most recent call last):
  File "/home/pybot/buildarea/2.5.klose-ubuntu-hppa/build/Lib/bsddb/test/test_associate.py", line 165, in setUp
    db.DB_INIT_LOCK | db.DB_THREAD | self.envFlags)
DBInvalidArgError: (22, 'Invalid argument -- Berkeley DB library configured to support only private environments')

======================================================================
ERROR: test02_associateAfterDB (bsddb.test.test_associate.AssociateRecnoTestCase)
----------------------------------------------------------------------

Traceback (most recent call last):
  File "/home/pybot/buildarea/2.5.klose-ubuntu-hppa/build/Lib/bsddb/test/test_associate.py", line 165, in setUp
    db.DB_INIT_LOCK | db.DB_THREAD | self.envFlags)
DBInvalidArgError: (22, 'Invalid argument -- Berkeley DB library configured to support only private environments')

======================================================================
ERROR: test01_associateWithDB (bsddb.test.test_associate.AssociateBTreeTxnTestCase)
----------------------------------------------------------------------

Traceback (most recent call last):
  File "/home/pybot/buildarea/2.5.klose-ubuntu-hppa/build/Lib/bsddb/test/test_associate.py", line 165, in setUp
    db.DB_INIT_LOCK | db.DB_THREAD | self.envFlags)
DBInvalidArgError: (22, 'Invalid argument -- Berkeley DB library configured to support only private environments')

======================================================================
ERROR: test02_associateAfterDB (bsddb.test.test_associate.AssociateBTreeTxnTestCase)
----------------------------------------------------------------------

Traceback (most recent call last):
  File "/home/pybot/buildarea/2.5.klose-ubuntu-hppa/build/Lib/bsddb/test/test_associate.py", line 165, in setUp
    db.DB_INIT_LOCK | db.DB_THREAD | self.envFlags)
DBInvalidArgError: (22, 'Invalid argument -- Berkeley DB library configured to support only private environments')

======================================================================
ERROR: test13_associate_in_transaction (bsddb.test.test_associate.AssociateBTreeTxnTestCase)
----------------------------------------------------------------------

Traceback (most recent call last):
  File "/home/pybot/buildarea/2.5.klose-ubuntu-hppa/build/Lib/bsddb/test/test_associate.py", line 165, in setUp
    db.DB_INIT_LOCK | db.DB_THREAD | self.envFlags)
DBInvalidArgError: (22, 'Invalid argument -- Berkeley DB library configured to support only private environments')

======================================================================
ERROR: test01_associateWithDB (bsddb.test.test_associate.ShelveAssociateHashTestCase)
----------------------------------------------------------------------

Traceback (most recent call last):
  File "/home/pybot/buildarea/2.5.klose-ubuntu-hppa/build/Lib/bsddb/test/test_associate.py", line 165, in setUp
    db.DB_INIT_LOCK | db.DB_THREAD | self.envFlags)
DBInvalidArgError: (22, 'Invalid argument -- Berkeley DB library configured to support only private environments')

======================================================================
ERROR: test02_associateAfterDB (bsddb.test.test_associate.ShelveAssociateHashTestCase)
----------------------------------------------------------------------

Traceback (most recent call last):
  File "/home/pybot/buildarea/2.5.klose-ubuntu-hppa/build/Lib/bsddb/test/test_associate.py", line 165, in setUp
    db.DB_INIT_LOCK | db.DB_THREAD | self.envFlags)
DBInvalidArgError: (22, 'Invalid argument -- Berkeley DB library configured to support only private environments')

======================================================================
ERROR: test01_associateWithDB (bsddb.test.test_associate.ShelveAssociateBTreeTestCase)
----------------------------------------------------------------------

Traceback (most recent call last):
  File "/home/pybot/buildarea/2.5.klose-ubuntu-hppa/build/Lib/bsddb/test/test_associate.py", line 165, in setUp
    db.DB_INIT_LOCK | db.DB_THREAD | self.envFlags)
DBInvalidArgError: (22, 'Invalid argument -- Berkeley DB library configured to support only private environments')

======================================================================
ERROR: test02_associateAfterDB (bsddb.test.test_associate.ShelveAssociateBTreeTestCase)
----------------------------------------------------------------------

Traceback (most recent call last):
  File "/home/pybot/buildarea/2.5.klose-ubuntu-hppa/build/Lib/bsddb/test/test_associate.py", line 165, in setUp
    db.DB_INIT_LOCK | db.DB_THREAD | self.envFlags)
DBInvalidArgError: (22, 'Invalid argument -- Berkeley DB library configured to support only private environments')

======================================================================
ERROR: test01_associateWithDB (bsddb.test.test_associate.ShelveAssociateRecnoTestCase)
----------------------------------------------------------------------

Traceback (most recent call last):
  File "/home/pybot/buildarea/2.5.klose-ubuntu-hppa/build/Lib/bsddb/test/test_associate.py", line 165, in setUp
    db.DB_INIT_LOCK | db.DB_THREAD | self.envFlags)
DBInvalidArgError: (22, 'Invalid argument -- Berkeley DB library configured to support only private environments')

======================================================================
ERROR: test02_associateAfterDB (bsddb.test.test_associate.ShelveAssociateRecnoTestCase)
----------------------------------------------------------------------

Traceback (most recent call last):
  File "/home/pybot/buildarea/2.5.klose-ubuntu-hppa/build/Lib/bsddb/test/test_associate.py", line 165, in setUp
    db.DB_INIT_LOCK | db.DB_THREAD | self.envFlags)
DBInvalidArgError: (22, 'Invalid argument -- Berkeley DB library configured to support only private environments')

======================================================================
ERROR: test01_associateWithDB (bsddb.test.test_associate.ThreadedAssociateHashTestCase)
----------------------------------------------------------------------

Traceback (most recent call last):
  File "/home/pybot/buildarea/2.5.klose-ubuntu-hppa/build/Lib/bsddb/test/test_associate.py", line 165, in setUp
    db.DB_INIT_LOCK | db.DB_THREAD | self.envFlags)
DBInvalidArgError: (22, 'Invalid argument -- Berkeley DB library configured to support only private environments')

======================================================================
ERROR: test02_associateAfterDB (bsddb.test.test_associate.ThreadedAssociateHashTestCase)
----------------------------------------------------------------------

Traceback (most recent call last):
  File "/home/pybot/buildarea/2.5.klose-ubuntu-hppa/build/Lib/bsddb/test/test_associate.py", line 165, in setUp
    db.DB_INIT_LOCK | db.DB_THREAD | self.envFlags)
DBInvalidArgError: (22, 'Invalid argument -- Berkeley DB library configured to support only private environments')

======================================================================
ERROR: test01_associateWithDB (bsddb.test.test_associate.ThreadedAssociateBTreeTestCase)
----------------------------------------------------------------------

Traceback (most recent call last):
  File "/home/pybot/buildarea/2.5.klose-ubuntu-hppa/build/Lib/bsddb/test/test_associate.py", line 165, in setUp
    db.DB_INIT_LOCK | db.DB_THREAD | self.envFlags)
DBInvalidArgError: (22, 'Invalid argument -- Berkeley DB library configured to support only private environments')

======================================================================
ERROR: test02_associateAfterDB (bsddb.test.test_associate.ThreadedAssociateBTreeTestCase)
----------------------------------------------------------------------

Traceback (most recent call last):
  File "/home/pybot/buildarea/2.5.klose-ubuntu-hppa/build/Lib/bsddb/test/test_associate.py", line 165, in setUp
    db.DB_INIT_LOCK | db.DB_THREAD | self.envFlags)
DBInvalidArgError: (22, 'Invalid argument -- Berkeley DB library configured to support only private environments')

======================================================================
ERROR: test01_associateWithDB (bsddb.test.test_associate.ThreadedAssociateRecnoTestCase)
----------------------------------------------------------------------

Traceback (most recent call last):
  File "/home/pybot/buildarea/2.5.klose-ubuntu-hppa/build/Lib/bsddb/test/test_associate.py", line 165, in setUp
    db.DB_INIT_LOCK | db.DB_THREAD | self.envFlags)
DBInvalidArgError: (22, 'Invalid argument -- Berkeley DB library configured to support only private environments')

======================================================================
ERROR: test02_associateAfterDB (bsddb.test.test_associate.ThreadedAssociateRecnoTestCase)
----------------------------------------------------------------------

Traceback (most recent call last):
  File "/home/pybot/buildarea/2.5.klose-ubuntu-hppa/build/Lib/bsddb/test/test_associate.py", line 165, in setUp
    db.DB_INIT_LOCK | db.DB_THREAD | self.envFlags)
DBInvalidArgError: (22, 'Invalid argument -- Berkeley DB library configured to support only private environments')

======================================================================
ERROR: test01_GetsAndPuts (bsddb.test.test_basics.BasicBTreeWithEnvTestCase)
----------------------------------------------------------------------

Traceback (most recent call last):
  File "/home/pybot/buildarea/2.5.klose-ubuntu-hppa/build/Lib/bsddb/test/test_basics.py", line 71, in setUp
    self.env.open(homeDir, self.envflags | db.DB_CREATE)
DBInvalidArgError: (22, 'Invalid argument -- Berkeley DB library configured to support only private environments')

======================================================================
ERROR: test02_DictionaryMethods (bsddb.test.test_basics.BasicBTreeWithEnvTestCase)
----------------------------------------------------------------------

Traceback (most recent call last):
  File "/home/pybot/buildarea/2.5.klose-ubuntu-hppa/build/Lib/bsddb/test/test_basics.py", line 71, in setUp
    self.env.open(homeDir, self.envflags | db.DB_CREATE)
DBInvalidArgError: (22, 'Invalid argument -- Berkeley DB library configured to support only private environments')

======================================================================
ERROR: test03_SimpleCursorStuff (bsddb.test.test_basics.BasicBTreeWithEnvTestCase)
----------------------------------------------------------------------

Traceback (most recent call last):
  File "/home/pybot/buildarea/2.5.klose-ubuntu-hppa/build/Lib/bsddb/test/test_basics.py", line 71, in setUp
    self.env.open(homeDir, self.envflags | db.DB_CREATE)
DBInvalidArgError: (22, 'Invalid argument -- Berkeley DB library configured to support only private environments')

======================================================================
ERROR: test03b_SimpleCursorWithGetReturnsNone1 (bsddb.test.test_basics.BasicBTreeWithEnvTestCase)
----------------------------------------------------------------------

Traceback (most recent call last):
  File "/home/pybot/buildarea/2.5.klose-ubuntu-hppa/build/Lib/bsddb/test/test_basics.py", line 71, in setUp
    self.env.open(homeDir, self.envflags | db.DB_CREATE)
DBInvalidArgError: (22, 'Invalid argument -- Berkeley DB library configured to support only private environments')

======================================================================
ERROR: test03b_SimpleCursorWithoutGetReturnsNone0 (bsddb.test.test_basics.BasicBTreeWithEnvTestCase)
----------------------------------------------------------------------

Traceback (most recent call last):
  File "/home/pybot/buildarea/2.5.klose-ubuntu-hppa/build/Lib/bsddb/test/test_basics.py", line 71, in setUp
    self.env.open(homeDir, self.envflags | db.DB_CREATE)
DBInvalidArgError: (22, 'Invalid argument -- Berkeley DB library configured to support only private environments')

======================================================================
ERROR: test03c_SimpleCursorGetReturnsNone2 (bsddb.test.test_basics.BasicBTreeWithEnvTestCase)
----------------------------------------------------------------------

Traceback (most recent call last):
  File "/home/pybot/buildarea/2.5.klose-ubuntu-hppa/build/Lib/bsddb/test/test_basics.py", line 71, in setUp
    self.env.open(homeDir, self.envflags | db.DB_CREATE)
DBInvalidArgError: (22, 'Invalid argument -- Berkeley DB library configured to support only private environments')

======================================================================
ERROR: test04_PartialGetAndPut (bsddb.test.test_basics.BasicBTreeWithEnvTestCase)
----------------------------------------------------------------------

Traceback (most recent call last):
  File "/home/pybot/buildarea/2.5.klose-ubuntu-hppa/build/Lib/bsddb/test/test_basics.py", line 71, in setUp
    self.env.open(homeDir, self.envflags | db.DB_CREATE)
DBInvalidArgError: (22, 'Invalid argument -- Berkeley DB library configured to support only private environments')

======================================================================
ERROR: test05_GetSize (bsddb.test.test_basics.BasicBTreeWithEnvTestCase)
----------------------------------------------------------------------

Traceback (most recent call last):
  File "/home/pybot/buildarea/2.5.klose-ubuntu-hppa/build/Lib/bsddb/test/test_basics.py", line 71, in setUp
    self.env.open(homeDir, self.envflags | db.DB_CREATE)
DBInvalidArgError: (22, 'Invalid argument -- Berkeley DB library configured to support only private environments')

======================================================================
ERROR: test06_Truncate (bsddb.test.test_basics.BasicBTreeWithEnvTestCase)
----------------------------------------------------------------------

Traceback (most recent call last):
  File "/home/pybot/buildarea/2.5.klose-ubuntu-hppa/build/Lib/bsddb/test/test_basics.py", line 71, in setUp
    self.env.open(homeDir, self.envflags | db.DB_CREATE)
DBInvalidArgError: (22, 'Invalid argument -- Berkeley DB library configured to support only private environments')

======================================================================
ERROR: test07_EnvRemoveAndRename (bsddb.test.test_basics.BasicBTreeWithEnvTestCase)
----------------------------------------------------------------------

Traceback (most recent call last):
  File "/home/pybot/buildarea/2.5.klose-ubuntu-hppa/build/Lib/bsddb/test/test_basics.py", line 71, in setUp
    self.env.open(homeDir, self.envflags | db.DB_CREATE)
DBInvalidArgError: (22, 'Invalid argument -- Berkeley DB library configured to support only private environments')

======================================================================
ERROR: test01_GetsAndPuts (bsddb.test.test_basics.BasicHashWithEnvTestCase)
----------------------------------------------------------------------

Traceback (most recent call last):
  File "/home/pybot/buildarea/2.5.klose-ubuntu-hppa/build/Lib/bsddb/test/test_basics.py", line 71, in setUp
    self.env.open(homeDir, self.envflags | db.DB_CREATE)
DBInvalidArgError: (22, 'Invalid argument -- Berkeley DB library configured to support only private environments')

======================================================================
ERROR: test02_DictionaryMethods (bsddb.test.test_basics.BasicHashWithEnvTestCase)
----------------------------------------------------------------------

Traceback (most recent call last):
  File "/home/pybot/buildarea/2.5.klose-ubuntu-hppa/build/Lib/bsddb/test/test_basics.py", line 71, in setUp
    self.env.open(homeDir, self.envflags | db.DB_CREATE)
DBInvalidArgError: (22, 'Invalid argument -- Berkeley DB library configured to support only private environments')

======================================================================
ERROR: test03_SimpleCursorStuff (bsddb.test.test_basics.BasicHashWithEnvTestCase)
----------------------------------------------------------------------

Traceback (most recent call last):
  File "/home/pybot/buildarea/2.5.klose-ubuntu-hppa/build/Lib/bsddb/test/test_basics.py", line 71, in setUp
    self.env.open(homeDir, self.envflags | db.DB_CREATE)
DBInvalidArgError: (22, 'Invalid argument -- Berkeley DB library configured to support only private environments')

======================================================================
ERROR: test03b_SimpleCursorWithGetReturnsNone1 (bsddb.test.test_basics.BasicHashWithEnvTestCase)
----------------------------------------------------------------------

Traceback (most recent call last):
  File "/home/pybot/buildarea/2.5.klose-ubuntu-hppa/build/Lib/bsddb/test/test_basics.py", line 71, in setUp
    self.env.open(homeDir, self.envflags | db.DB_CREATE)
DBInvalidArgError: (22, 'Invalid argument -- Berkeley DB library configured to support only private environments')

======================================================================
ERROR: test03b_SimpleCursorWithoutGetReturnsNone0 (bsddb.test.test_basics.BasicHashWithEnvTestCase)
----------------------------------------------------------------------

Traceback (most recent call last):
  File "/home/pybot/buildarea/2.5.klose-ubuntu-hppa/build/Lib/bsddb/test/test_basics.py", line 71, in setUp
    self.env.open(homeDir, self.envflags | db.DB_CREATE)
DBInvalidArgError: (22, 'Invalid argument -- Berkeley DB library configured to support only private environments')

======================================================================
ERROR: test03c_SimpleCursorGetReturnsNone2 (bsddb.test.test_basics.BasicHashWithEnvTestCase)
----------------------------------------------------------------------

Traceback (most recent call last):
  File "/home/pybot/buildarea/2.5.klose-ubuntu-hppa/build/Lib/bsddb/test/test_basics.py", line 71, in setUp
    self.env.open(homeDir, self.envflags | db.DB_CREATE)
DBInvalidArgError: (22, 'Invalid argument -- Berkeley DB library configured to support only private environments')

======================================================================
ERROR: test04_PartialGetAndPut (bsddb.test.test_basics.BasicHashWithEnvTestCase)
----------------------------------------------------------------------

Traceback (most recent call last):
  File "/home/pybot/buildarea/2.5.klose-ubuntu-hppa/build/Lib/bsddb/test/test_basics.py", line 71, in setUp
    self.env.open(homeDir, self.envflags | db.DB_CREATE)
DBInvalidArgError: (22, 'Invalid argument -- Berkeley DB library configured to support only private environments')

======================================================================
ERROR: test05_GetSize (bsddb.test.test_basics.BasicHashWithEnvTestCase)
----------------------------------------------------------------------

Traceback (most recent call last):
  File "/home/pybot/buildarea/2.5.klose-ubuntu-hppa/build/Lib/bsddb/test/test_basics.py", line 71, in setUp
    self.env.open(homeDir, self.envflags | db.DB_CREATE)
DBInvalidArgError: (22, 'Invalid argument -- Berkeley DB library configured to support only private environments')

======================================================================
ERROR: test06_Truncate (bsddb.test.test_basics.BasicHashWithEnvTestCase)
----------------------------------------------------------------------

Traceback (most recent call last):
  File "/home/pybot/buildarea/2.5.klose-ubuntu-hppa/build/Lib/bsddb/test/test_basics.py", line 71, in setUp
    self.env.open(homeDir, self.envflags | db.DB_CREATE)
DBInvalidArgError: (22, 'Invalid argument -- Berkeley DB library configured to support only private environments')

======================================================================
ERROR: test07_EnvRemoveAndRename (bsddb.test.test_basics.BasicHashWithEnvTestCase)
----------------------------------------------------------------------

Traceback (most recent call last):
  File "/home/pybot/buildarea/2.5.klose-ubuntu-hppa/build/Lib/bsddb/test/test_basics.py", line 71, in setUp
    self.env.open(homeDir, self.envflags | db.DB_CREATE)
DBInvalidArgError: (22, 'Invalid argument -- Berkeley DB library configured to support only private environments')

======================================================================
ERROR: test01_GetsAndPuts (bsddb.test.test_basics.BTreeTransactionTestCase)
----------------------------------------------------------------------

Traceback (most recent call last):
  File "/home/pybot/buildarea/2.5.klose-ubuntu-hppa/build/Lib/bsddb/test/test_basics.py", line 71, in setUp
    self.env.open(homeDir, self.envflags | db.DB_CREATE)
DBInvalidArgError: (22, 'Invalid argument -- Berkeley DB library configured to support only private environments')

======================================================================
ERROR: test02_DictionaryMethods (bsddb.test.test_basics.BTreeTransactionTestCase)
----------------------------------------------------------------------

Traceback (most recent call last):
  File "/home/pybot/buildarea/2.5.klose-ubuntu-hppa/build/Lib/bsddb/test/test_basics.py", line 71, in setUp
    self.env.open(homeDir, self.envflags | db.DB_CREATE)
DBInvalidArgError: (22, 'Invalid argument -- Berkeley DB library configured to support only private environments')

======================================================================
ERROR: test03_SimpleCursorStuff (bsddb.test.test_basics.BTreeTransactionTestCase)
----------------------------------------------------------------------

Traceback (most recent call last):
  File "/home/pybot/buildarea/2.5.klose-ubuntu-hppa/build/Lib/bsddb/test/test_basics.py", line 71, in setUp
    self.env.open(homeDir, self.envflags | db.DB_CREATE)
DBInvalidArgError: (22, 'Invalid argument -- Berkeley DB library configured to support only private environments')

======================================================================
ERROR: test03b_SimpleCursorWithGetReturnsNone1 (bsddb.test.test_basics.BTreeTransactionTestCase)
----------------------------------------------------------------------

Traceback (most recent call last):
  File "/home/pybot/buildarea/2.5.klose-ubuntu-hppa/build/Lib/bsddb/test/test_basics.py", line 71, in setUp
    self.env.open(homeDir, self.envflags | db.DB_CREATE)
DBInvalidArgError: (22, 'Invalid argument -- Berkeley DB library configured to support only private environments')

======================================================================
ERROR: test03b_SimpleCursorWithoutGetReturnsNone0 (bsddb.test.test_basics.BTreeTransactionTestCase)
----------------------------------------------------------------------

Traceback (most recent call last):
  File "/home/pybot/buildarea/2.5.klose-ubuntu-hppa/build/Lib/bsddb/test/test_basics.py", line 71, in setUp
    self.env.open(homeDir, self.envflags | db.DB_CREATE)
DBInvalidArgError: (22, 'Invalid argument -- Berkeley DB library configured to support only private environments')

======================================================================
ERROR: test03c_SimpleCursorGetReturnsNone2 (bsddb.test.test_basics.BTreeTransactionTestCase)
----------------------------------------------------------------------

Traceback (most recent call last):
  File "/home/pybot/buildarea/2.5.klose-ubuntu-hppa/build/Lib/bsddb/test/test_basics.py", line 71, in setUp
    self.env.open(homeDir, self.envflags | db.DB_CREATE)
DBInvalidArgError: (22, 'Invalid argument -- Berkeley DB library configured to support only private environments')

======================================================================
ERROR: test04_PartialGetAndPut (bsddb.test.test_basics.BTreeTransactionTestCase)
----------------------------------------------------------------------

Traceback (most recent call last):
  File "/home/pybot/buildarea/2.5.klose-ubuntu-hppa/build/Lib/bsddb/test/test_basics.py", line 71, in setUp
    self.env.open(homeDir, self.envflags | db.DB_CREATE)
DBInvalidArgError: (22, 'Invalid argument -- Berkeley DB library configured to support only private environments')

======================================================================
ERROR: test05_GetSize (bsddb.test.test_basics.BTreeTransactionTestCase)
----------------------------------------------------------------------

Traceback (most recent call last):
  File "/home/pybot/buildarea/2.5.klose-ubuntu-hppa/build/Lib/bsddb/test/test_basics.py", line 71, in setUp
    self.env.open(homeDir, self.envflags | db.DB_CREATE)
DBInvalidArgError: (22, 'Invalid argument -- Berkeley DB library configured to support only private environments')

======================================================================
ERROR: test06_Transactions (bsddb.test.test_basics.BTreeTransactionTestCase)
----------------------------------------------------------------------

Traceback (most recent call last):
  File "/home/pybot/buildarea/2.5.klose-ubuntu-hppa/build/Lib/bsddb/test/test_basics.py", line 71, in setUp
    self.env.open(homeDir, self.envflags | db.DB_CREATE)
DBInvalidArgError: (22, 'Invalid argument -- Berkeley DB library configured to support only private environments')

======================================================================
ERROR: test06_Truncate (bsddb.test.test_basics.BTreeTransactionTestCase)
----------------------------------------------------------------------

Traceback (most recent call last):
  File "/home/pybot/buildarea/2.5.klose-ubuntu-hppa/build/Lib/bsddb/test/test_basics.py", line 71, in setUp
    self.env.open(homeDir, self.envflags | db.DB_CREATE)
DBInvalidArgError: (22, 'Invalid argument -- Berkeley DB library configured to support only private environments')

======================================================================
ERROR: test07_TxnTruncate (bsddb.test.test_basics.BTreeTransactionTestCase)
----------------------------------------------------------------------

Traceback (most recent call last):
  File "/home/pybot/buildarea/2.5.klose-ubuntu-hppa/build/Lib/bsddb/test/test_basics.py", line 71, in setUp
    self.env.open(homeDir, self.envflags | db.DB_CREATE)
DBInvalidArgError: (22, 'Invalid argument -- Berkeley DB library configured to support only private environments')

======================================================================
ERROR: test08_TxnLateUse (bsddb.test.test_basics.BTreeTransactionTestCase)
----------------------------------------------------------------------

Traceback (most recent call last):
  File "/home/pybot/buildarea/2.5.klose-ubuntu-hppa/build/Lib/bsddb/test/test_basics.py", line 71, in setUp
    self.env.open(homeDir, self.envflags | db.DB_CREATE)
DBInvalidArgError: (22, 'Invalid argument -- Berkeley DB library configured to support only private environments')

======================================================================
ERROR: test01_GetsAndPuts (bsddb.test.test_basics.HashTransactionTestCase)
----------------------------------------------------------------------

Traceback (most recent call last):
  File "/home/pybot/buildarea/2.5.klose-ubuntu-hppa/build/Lib/bsddb/test/test_basics.py", line 71, in setUp
    self.env.open(homeDir, self.envflags | db.DB_CREATE)
DBInvalidArgError: (22, 'Invalid argument -- Berkeley DB library configured to support only private environments')

======================================================================
ERROR: test02_DictionaryMethods (bsddb.test.test_basics.HashTransactionTestCase)
----------------------------------------------------------------------

Traceback (most recent call last):
  File "/home/pybot/buildarea/2.5.klose-ubuntu-hppa/build/Lib/bsddb/test/test_basics.py", line 71, in setUp
    self.env.open(homeDir, self.envflags | db.DB_CREATE)
DBInvalidArgError: (22, 'Invalid argument -- Berkeley DB library configured to support only private environments')

======================================================================
ERROR: test03_SimpleCursorStuff (bsddb.test.test_basics.HashTransactionTestCase)
----------------------------------------------------------------------

Traceback (most recent call last):
  File "/home/pybot/buildarea/2.5.klose-ubuntu-hppa/build/Lib/bsddb/test/test_basics.py", line 71, in setUp
    self.env.open(homeDir, self.envflags | db.DB_CREATE)
DBInvalidArgError: (22, 'Invalid argument -- Berkeley DB library configured to support only private environments')

======================================================================
ERROR: test03b_SimpleCursorWithGetReturnsNone1 (bsddb.test.test_basics.HashTransactionTestCase)
----------------------------------------------------------------------

Traceback (most recent call last):
  File "/home/pybot/buildarea/2.5.klose-ubuntu-hppa/build/Lib/bsddb/test/test_basics.py", line 71, in setUp
    self.env.open(homeDir, self.envflags | db.DB_CREATE)
DBInvalidArgError: (22, 'Invalid argument -- Berkeley DB library configured to support only private environments')

======================================================================
ERROR: test03b_SimpleCursorWithoutGetReturnsNone0 (bsddb.test.test_basics.HashTransactionTestCase)
----------------------------------------------------------------------

Traceback (most recent call last):
  File "/home/pybot/buildarea/2.5.klose-ubuntu-hppa/build/Lib/bsddb/test/test_basics.py", line 71, in setUp
    self.env.open(homeDir, self.envflags | db.DB_CREATE)
DBInvalidArgError: (22, 'Invalid argument -- Berkeley DB library configured to support only private environments')

======================================================================
ERROR: test03c_SimpleCursorGetReturnsNone2 (bsddb.test.test_basics.HashTransactionTestCase)
----------------------------------------------------------------------

Traceback (most recent call last):
  File "/home/pybot/buildarea/2.5.klose-ubuntu-hppa/build/Lib/bsddb/test/test_basics.py", line 71, in setUp
    self.env.open(homeDir, self.envflags | db.DB_CREATE)
DBInvalidArgError: (22, 'Invalid argument -- Berkeley DB library configured to support only private environments')

======================================================================
ERROR: test04_PartialGetAndPut (bsddb.test.test_basics.HashTransactionTestCase)
----------------------------------------------------------------------

Traceback (most recent call last):
  File "/home/pybot/buildarea/2.5.klose-ubuntu-hppa/build/Lib/bsddb/test/test_basics.py", line 71, in setUp
    self.env.open(homeDir, self.envflags | db.DB_CREATE)
DBInvalidArgError: (22, 'Invalid argument -- Berkeley DB library configured to support only private environments')

======================================================================
ERROR: test05_GetSize (bsddb.test.test_basics.HashTransactionTestCase)
----------------------------------------------------------------------

Traceback (most recent call last):
  File "/home/pybot/buildarea/2.5.klose-ubuntu-hppa/build/Lib/bsddb/test/test_basics.py", line 71, in setUp
    self.env.open(homeDir, self.envflags | db.DB_CREATE)
DBInvalidArgError: (22, 'Invalid argument -- Berkeley DB library configured to support only private environments')

======================================================================
ERROR: test06_Transactions (bsddb.test.test_basics.HashTransactionTestCase)
----------------------------------------------------------------------

Traceback (most recent call last):
  File "/home/pybot/buildarea/2.5.klose-ubuntu-hppa/build/Lib/bsddb/test/test_basics.py", line 71, in setUp
    self.env.open(homeDir, self.envflags | db.DB_CREATE)
DBInvalidArgError: (22, 'Invalid argument -- Berkeley DB library configured to support only private environments')

======================================================================
ERROR: test06_Truncate (bsddb.test.test_basics.HashTransactionTestCase)
----------------------------------------------------------------------

Traceback (most recent call last):
  File "/home/pybot/buildarea/2.5.klose-ubuntu-hppa/build/Lib/bsddb/test/test_basics.py", line 71, in setUp
    self.env.open(homeDir, self.envflags | db.DB_CREATE)
DBInvalidArgError: (22, 'Invalid argument -- Berkeley DB library configured to support only private environments')

======================================================================
ERROR: test07_TxnTruncate (bsddb.test.test_basics.HashTransactionTestCase)
----------------------------------------------------------------------

Traceback (most recent call last):
  File "/home/pybot/buildarea/2.5.klose-ubuntu-hppa/build/Lib/bsddb/test/test_basics.py", line 71, in setUp
    self.env.open(homeDir, self.envflags | db.DB_CREATE)
DBInvalidArgError: (22, 'Invalid argument -- Berkeley DB library configured to support only private environments')

======================================================================
ERROR: test08_TxnLateUse (bsddb.test.test_basics.HashTransactionTestCase)
----------------------------------------------------------------------

Traceback (most recent call last):
  File "/home/pybot/buildarea/2.5.klose-ubuntu-hppa/build/Lib/bsddb/test/test_basics.py", line 71, in setUp
    self.env.open(homeDir, self.envflags | db.DB_CREATE)
DBInvalidArgError: (22, 'Invalid argument -- Berkeley DB library configured to support only private environments')

======================================================================
ERROR: test01_GetsAndPuts (bsddb.test.test_basics.BTreeMultiDBTestCase)
----------------------------------------------------------------------

Traceback (most recent call last):
  File "/home/pybot/buildarea/2.5.klose-ubuntu-hppa/build/Lib/bsddb/test/test_basics.py", line 71, in setUp
    self.env.open(homeDir, self.envflags | db.DB_CREATE)
DBInvalidArgError: (22, 'Invalid argument -- Berkeley DB library configured to support only private environments')

======================================================================
ERROR: test02_DictionaryMethods (bsddb.test.test_basics.BTreeMultiDBTestCase)
----------------------------------------------------------------------

Traceback (most recent call last):
  File "/home/pybot/buildarea/2.5.klose-ubuntu-hppa/build/Lib/bsddb/test/test_basics.py", line 71, in setUp
    self.env.open(homeDir, self.envflags | db.DB_CREATE)
DBInvalidArgError: (22, 'Invalid argument -- Berkeley DB library configured to support only private environments')

======================================================================
ERROR: test03_SimpleCursorStuff (bsddb.test.test_basics.BTreeMultiDBTestCase)
----------------------------------------------------------------------

Traceback (most recent call last):
  File "/home/pybot/buildarea/2.5.klose-ubuntu-hppa/build/Lib/bsddb/test/test_basics.py", line 71, in setUp
    self.env.open(homeDir, self.envflags | db.DB_CREATE)
DBInvalidArgError: (22, 'Invalid argument -- Berkeley DB library configured to support only private environments')

======================================================================
ERROR: test03b_SimpleCursorWithGetReturnsNone1 (bsddb.test.test_basics.BTreeMultiDBTestCase)
----------------------------------------------------------------------

Traceback (most recent call last):
  File "/home/pybot/buildarea/2.5.klose-ubuntu-hppa/build/Lib/bsddb/test/test_basics.py", line 71, in setUp
    self.env.open(homeDir, self.envflags | db.DB_CREATE)
DBInvalidArgError: (22, 'Invalid argument -- Berkeley DB library configured to support only private environments')

======================================================================
ERROR: test03b_SimpleCursorWithoutGetReturnsNone0 (bsddb.test.test_basics.BTreeMultiDBTestCase)
----------------------------------------------------------------------

Traceback (most recent call last):
  File "/home/pybot/buildarea/2.5.klose-ubuntu-hppa/build/Lib/bsddb/test/test_basics.py", line 71, in setUp
    self.env.open(homeDir, self.envflags | db.DB_CREATE)
DBInvalidArgError: (22, 'Invalid argument -- Berkeley DB library configured to support only private environments')

======================================================================
ERROR: test03c_SimpleCursorGetReturnsNone2 (bsddb.test.test_basics.BTreeMultiDBTestCase)
----------------------------------------------------------------------

Traceback (most recent call last):
  File "/home/pybot/buildarea/2.5.klose-ubuntu-hppa/build/Lib/bsddb/test/test_basics.py", line 71, in setUp
    self.env.open(homeDir, self.envflags | db.DB_CREATE)
DBInvalidArgError: (22, 'Invalid argument -- Berkeley DB library configured to support only private environments')

======================================================================
ERROR: test04_PartialGetAndPut (bsddb.test.test_basics.BTreeMultiDBTestCase)
----------------------------------------------------------------------

Traceback (most recent call last):
  File "/home/pybot/buildarea/2.5.klose-ubuntu-hppa/build/Lib/bsddb/test/test_basics.py", line 71, in setUp
    self.env.open(homeDir, self.envflags | db.DB_CREATE)
DBInvalidArgError: (22, 'Invalid argument -- Berkeley DB library configured to support only private environments')

======================================================================
ERROR: test05_GetSize (bsddb.test.test_basics.BTreeMultiDBTestCase)
----------------------------------------------------------------------

Traceback (most recent call last):
  File "/home/pybot/buildarea/2.5.klose-ubuntu-hppa/build/Lib/bsddb/test/test_basics.py", line 71, in setUp
    self.env.open(homeDir, self.envflags | db.DB_CREATE)
DBInvalidArgError: (22, 'Invalid argument -- Berkeley DB library configured to support only private environments')

======================================================================
ERROR: test06_Truncate (bsddb.test.test_basics.BTreeMultiDBTestCase)
----------------------------------------------------------------------

Traceback (most recent call last):
  File "/home/pybot/buildarea/2.5.klose-ubuntu-hppa/build/Lib/bsddb/test/test_basics.py", line 71, in setUp
    self.env.open(homeDir, self.envflags | db.DB_CREATE)
DBInvalidArgError: (22, 'Invalid argument -- Berkeley DB library configured to support only private environments')

======================================================================
ERROR: test09_MultiDB (bsddb.test.test_basics.BTreeMultiDBTestCase)
----------------------------------------------------------------------

Traceback (most recent call last):
  File "/home/pybot/buildarea/2.5.klose-ubuntu-hppa/build/Lib/bsddb/test/test_basics.py", line 71, in setUp
    self.env.open(homeDir, self.envflags | db.DB_CREATE)
DBInvalidArgError: (22, 'Invalid argument -- Berkeley DB library configured to support only private environments')

======================================================================
ERROR: test01_GetsAndPuts (bsddb.test.test_basics.HashMultiDBTestCase)
----------------------------------------------------------------------

Traceback (most recent call last):
  File "/home/pybot/buildarea/2.5.klose-ubuntu-hppa/build/Lib/bsddb/test/test_basics.py", line 71, in setUp
    self.env.open(homeDir, self.envflags | db.DB_CREATE)
DBInvalidArgError: (22, 'Invalid argument -- Berkeley DB library configured to support only private environments')

======================================================================
ERROR: test02_DictionaryMethods (bsddb.test.test_basics.HashMultiDBTestCase)
----------------------------------------------------------------------

Traceback (most recent call last):
  File "/home/pybot/buildarea/2.5.klose-ubuntu-hppa/build/Lib/bsddb/test/test_basics.py", line 71, in setUp
    self.env.open(homeDir, self.envflags | db.DB_CREATE)
DBInvalidArgError: (22, 'Invalid argument -- Berkeley DB library configured to support only private environments')

======================================================================
ERROR: test03_SimpleCursorStuff (bsddb.test.test_basics.HashMultiDBTestCase)
----------------------------------------------------------------------

Traceback (most recent call last):
  File "/home/pybot/buildarea/2.5.klose-ubuntu-hppa/build/Lib/bsddb/test/test_basics.py", line 71, in setUp
    self.env.open(homeDir, self.envflags | db.DB_CREATE)
DBInvalidArgError: (22, 'Invalid argument -- Berkeley DB library configured to support only private environments')

======================================================================
ERROR: test03b_SimpleCursorWithGetReturnsNone1 (bsddb.test.test_basics.HashMultiDBTestCase)
----------------------------------------------------------------------

Traceback (most recent call last):
  File "/home/pybot/buildarea/2.5.klose-ubuntu-hppa/build/Lib/bsddb/test/test_basics.py", line 71, in setUp
    self.env.open(homeDir, self.envflags | db.DB_CREATE)
DBInvalidArgError: (22, 'Invalid argument -- Berkeley DB library configured to support only private environments')

======================================================================
ERROR: test03b_SimpleCursorWithoutGetReturnsNone0 (bsddb.test.test_basics.HashMultiDBTestCase)
----------------------------------------------------------------------

Traceback (most recent call last):
  File "/home/pybot/buildarea/2.5.klose-ubuntu-hppa/build/Lib/bsddb/test/test_basics.py", line 71, in setUp
    self.env.open(homeDir, self.envflags | db.DB_CREATE)
DBInvalidArgError: (22, 'Invalid argument -- Berkeley DB library configured to support only private environments')

======================================================================
ERROR: test03c_SimpleCursorGetReturnsNone2 (bsddb.test.test_basics.HashMultiDBTestCase)
----------------------------------------------------------------------

Traceback (most recent call last):
  File "/home/pybot/buildarea/2.5.klose-ubuntu-hppa/build/Lib/bsddb/test/test_basics.py", line 71, in setUp
    self.env.open(homeDir, self.envflags | db.DB_CREATE)
DBInvalidArgError: (22, 'Invalid argument -- Berkeley DB library configured to support only private environments')

======================================================================
ERROR: test04_PartialGetAndPut (bsddb.test.test_basics.HashMultiDBTestCase)
----------------------------------------------------------------------

Traceback (most recent call last):
  File "/home/pybot/buildarea/2.5.klose-ubuntu-hppa/build/Lib/bsddb/test/test_basics.py", line 71, in setUp
    self.env.open(homeDir, self.envflags | db.DB_CREATE)
DBInvalidArgError: (22, 'Invalid argument -- Berkeley DB library configured to support only private environments')

======================================================================
ERROR: test05_GetSize (bsddb.test.test_basics.HashMultiDBTestCase)
----------------------------------------------------------------------

Traceback (most recent call last):
  File "/home/pybot/buildarea/2.5.klose-ubuntu-hppa/build/Lib/bsddb/test/test_basics.py", line 71, in setUp
    self.env.open(homeDir, self.envflags | db.DB_CREATE)
DBInvalidArgError: (22, 'Invalid argument -- Berkeley DB library configured to support only private environments')

======================================================================
ERROR: test06_Truncate (bsddb.test.test_basics.HashMultiDBTestCase)
----------------------------------------------------------------------

Traceback (most recent call last):
  File "/home/pybot/buildarea/2.5.klose-ubuntu-hppa/build/Lib/bsddb/test/test_basics.py", line 71, in setUp
    self.env.open(homeDir, self.envflags | db.DB_CREATE)
DBInvalidArgError: (22, 'Invalid argument -- Berkeley DB library configured to support only private environments')

======================================================================
ERROR: test09_MultiDB (bsddb.test.test_basics.HashMultiDBTestCase)
----------------------------------------------------------------------

Traceback (most recent call last):
  File "/home/pybot/buildarea/2.5.klose-ubuntu-hppa/build/Lib/bsddb/test/test_basics.py", line 71, in setUp
    self.env.open(homeDir, self.envflags | db.DB_CREATE)
DBInvalidArgError: (22, 'Invalid argument -- Berkeley DB library configured to support only private environments')

======================================================================
ERROR: test01_both (bsddb.test.test_dbobj.dbobjTestCase)
----------------------------------------------------------------------

Traceback (most recent call last):
  File "/home/pybot/buildarea/2.5.klose-ubuntu-hppa/build/Lib/bsddb/test/test_dbobj.py", line 44, in test01_both
    self.env.open(self.homeDir, db.DB_CREATE | db.DB_INIT_MPOOL)
  File "/home/pybot/buildarea/2.5.klose-ubuntu-hppa/build/Lib/bsddb/dbobj.py", line 39, in open
    return apply(self._cobj.open, args, kwargs)
DBInvalidArgError: (22, 'Invalid argument -- Berkeley DB library configured to support only private environments')

======================================================================
ERROR: test02_dbobj_dict_interface (bsddb.test.test_dbobj.dbobjTestCase)
----------------------------------------------------------------------

Traceback (most recent call last):
  File "/home/pybot/buildarea/2.5.klose-ubuntu-hppa/build/Lib/bsddb/test/test_dbobj.py", line 57, in test02_dbobj_dict_interface
    self.env.open(self.homeDir, db.DB_CREATE | db.DB_INIT_MPOOL)
  File "/home/pybot/buildarea/2.5.klose-ubuntu-hppa/build/Lib/bsddb/dbobj.py", line 39, in open
    return apply(self._cobj.open, args, kwargs)
DBInvalidArgError: (22, 'Invalid argument -- Berkeley DB library configured to support only private environments')

======================================================================
ERROR: test01_basics (bsddb.test.test_dbshelve.EnvBTreeShelveTestCase)
----------------------------------------------------------------------

Traceback (most recent call last):
  File "/home/pybot/buildarea/2.5.klose-ubuntu-hppa/build/Lib/bsddb/test/test_dbshelve.py", line 35, in setUp
    self.do_open()
  File "/home/pybot/buildarea/2.5.klose-ubuntu-hppa/build/Lib/bsddb/test/test_dbshelve.py", line 253, in do_open
    self.env.open(homeDir, self.envflags | db.DB_INIT_MPOOL | db.DB_CREATE)
DBInvalidArgError: (22, 'Invalid argument -- Berkeley DB library configured to support only private environments')

======================================================================
ERROR: test02_cursors (bsddb.test.test_dbshelve.EnvBTreeShelveTestCase)
----------------------------------------------------------------------

Traceback (most recent call last):
  File "/home/pybot/buildarea/2.5.klose-ubuntu-hppa/build/Lib/bsddb/test/test_dbshelve.py", line 35, in setUp
    self.do_open()
  File "/home/pybot/buildarea/2.5.klose-ubuntu-hppa/build/Lib/bsddb/test/test_dbshelve.py", line 253, in do_open
    self.env.open(homeDir, self.envflags | db.DB_INIT_MPOOL | db.DB_CREATE)
DBInvalidArgError: (22, 'Invalid argument -- Berkeley DB library configured to support only private environments')

======================================================================
ERROR: test03_append (bsddb.test.test_dbshelve.EnvBTreeShelveTestCase)
----------------------------------------------------------------------

Traceback (most recent call last):
  File "/home/pybot/buildarea/2.5.klose-ubuntu-hppa/build/Lib/bsddb/test/test_dbshelve.py", line 35, in setUp
    self.do_open()
  File "/home/pybot/buildarea/2.5.klose-ubuntu-hppa/build/Lib/bsddb/test/test_dbshelve.py", line 253, in do_open
    self.env.open(homeDir, self.envflags | db.DB_INIT_MPOOL | db.DB_CREATE)
DBInvalidArgError: (22, 'Invalid argument -- Berkeley DB library configured to support only private environments')

======================================================================
ERROR: test01_basics (bsddb.test.test_dbshelve.EnvHashShelveTestCase)
----------------------------------------------------------------------

Traceback (most recent call last):
  File "/home/pybot/buildarea/2.5.klose-ubuntu-hppa/build/Lib/bsddb/test/test_dbshelve.py", line 35, in setUp
    self.do_open()
  File "/home/pybot/buildarea/2.5.klose-ubuntu-hppa/build/Lib/bsddb/test/test_dbshelve.py", line 253, in do_open
    self.env.open(homeDir, self.envflags | db.DB_INIT_MPOOL | db.DB_CREATE)
DBInvalidArgError: (22, 'Invalid argument -- Berkeley DB library configured to support only private environments')

======================================================================
ERROR: test02_cursors (bsddb.test.test_dbshelve.EnvHashShelveTestCase)
----------------------------------------------------------------------

Traceback (most recent call last):
  File "/home/pybot/buildarea/2.5.klose-ubuntu-hppa/build/Lib/bsddb/test/test_dbshelve.py", line 35, in setUp
    self.do_open()
  File "/home/pybot/buildarea/2.5.klose-ubuntu-hppa/build/Lib/bsddb/test/test_dbshelve.py", line 253, in do_open
    self.env.open(homeDir, self.envflags | db.DB_INIT_MPOOL | db.DB_CREATE)
DBInvalidArgError: (22, 'Invalid argument -- Berkeley DB library configured to support only private environments')

======================================================================
ERROR: test03_append (bsddb.test.test_dbshelve.EnvHashShelveTestCase)
----------------------------------------------------------------------

Traceback (most recent call last):
  File "/home/pybot/buildarea/2.5.klose-ubuntu-hppa/build/Lib/bsddb/test/test_dbshelve.py", line 35, in setUp
    self.do_open()
  File "/home/pybot/buildarea/2.5.klose-ubuntu-hppa/build/Lib/bsddb/test/test_dbshelve.py", line 253, in do_open
    self.env.open(homeDir, self.envflags | db.DB_INIT_MPOOL | db.DB_CREATE)
DBInvalidArgError: (22, 'Invalid argument -- Berkeley DB library configured to support only private environments')

======================================================================
ERROR: test01_basics (bsddb.test.test_dbshelve.EnvThreadBTreeShelveTestCase)
----------------------------------------------------------------------

Traceback (most recent call last):
  File "/home/pybot/buildarea/2.5.klose-ubuntu-hppa/build/Lib/bsddb/test/test_dbshelve.py", line 35, in setUp
    self.do_open()
  File "/home/pybot/buildarea/2.5.klose-ubuntu-hppa/build/Lib/bsddb/test/test_dbshelve.py", line 253, in do_open
    self.env.open(homeDir, self.envflags | db.DB_INIT_MPOOL | db.DB_CREATE)
DBInvalidArgError: (22, 'Invalid argument -- Berkeley DB library configured to support only private environments')

======================================================================
ERROR: test02_cursors (bsddb.test.test_dbshelve.EnvThreadBTreeShelveTestCase)
----------------------------------------------------------------------

Traceback (most recent call last):
  File "/home/pybot/buildarea/2.5.klose-ubuntu-hppa/build/Lib/bsddb/test/test_dbshelve.py", line 35, in setUp
    self.do_open()
  File "/home/pybot/buildarea/2.5.klose-ubuntu-hppa/build/Lib/bsddb/test/test_dbshelve.py", line 253, in do_open
    self.env.open(homeDir, self.envflags | db.DB_INIT_MPOOL | db.DB_CREATE)
DBInvalidArgError: (22, 'Invalid argument -- Berkeley DB library configured to support only private environments')

======================================================================
ERROR: test03_append (bsddb.test.test_dbshelve.EnvThreadBTreeShelveTestCase)
----------------------------------------------------------------------

Traceback (most recent call last):
  File "/home/pybot/buildarea/2.5.klose-ubuntu-hppa/build/Lib/bsddb/test/test_dbshelve.py", line 35, in setUp
    self.do_open()
  File "/home/pybot/buildarea/2.5.klose-ubuntu-hppa/build/Lib/bsddb/test/test_dbshelve.py", line 253, in do_open
    self.env.open(homeDir, self.envflags | db.DB_INIT_MPOOL | db.DB_CREATE)
DBInvalidArgError: (22, 'Invalid argument -- Berkeley DB library configured to support only private environments')

======================================================================
ERROR: test01_basics (bsddb.test.test_dbshelve.EnvThreadHashShelveTestCase)
----------------------------------------------------------------------

Traceback (most recent call last):
  File "/home/pybot/buildarea/2.5.klose-ubuntu-hppa/build/Lib/bsddb/test/test_dbshelve.py", line 35, in setUp
    self.do_open()
  File "/home/pybot/buildarea/2.5.klose-ubuntu-hppa/build/Lib/bsddb/test/test_dbshelve.py", line 253, in do_open
    self.env.open(homeDir, self.envflags | db.DB_INIT_MPOOL | db.DB_CREATE)
DBInvalidArgError: (22, 'Invalid argument -- Berkeley DB library configured to support only private environments')

======================================================================
ERROR: test02_cursors (bsddb.test.test_dbshelve.EnvThreadHashShelveTestCase)
----------------------------------------------------------------------

Traceback (most recent call last):
  File "/home/pybot/buildarea/2.5.klose-ubuntu-hppa/build/Lib/bsddb/test/test_dbshelve.py", line 35, in setUp
    self.do_open()
  File "/home/pybot/buildarea/2.5.klose-ubuntu-hppa/build/Lib/bsddb/test/test_dbshelve.py", line 253, in do_open
    self.env.open(homeDir, self.envflags | db.DB_INIT_MPOOL | db.DB_CREATE)
DBInvalidArgError: (22, 'Invalid argument -- Berkeley DB library configured to support only private environments')

======================================================================
ERROR: test03_append (bsddb.test.test_dbshelve.EnvThreadHashShelveTestCase)
----------------------------------------------------------------------

Traceback (most recent call last):
  File "/home/pybot/buildarea/2.5.klose-ubuntu-hppa/build/Lib/bsddb/test/test_dbshelve.py", line 35, in setUp
    self.do_open()
  File "/home/pybot/buildarea/2.5.klose-ubuntu-hppa/build/Lib/bsddb/test/test_dbshelve.py", line 253, in do_open
    self.env.open(homeDir, self.envflags | db.DB_INIT_MPOOL | db.DB_CREATE)
DBInvalidArgError: (22, 'Invalid argument -- Berkeley DB library configured to support only private environments')

======================================================================
ERROR: test01 (bsddb.test.test_dbtables.TableDBTestCase)
----------------------------------------------------------------------

Traceback (most recent call last):
  File "/home/pybot/buildarea/2.5.klose-ubuntu-hppa/build/Lib/bsddb/test/test_dbtables.py", line 52, in setUp
    filename='tabletest.db', dbhome=homeDir, create=1)
  File "/home/pybot/buildarea/2.5.klose-ubuntu-hppa/build/Lib/bsddb/dbtables.py", line 161, in __init__
    self.env.open(dbhome, myflags | flagsforenv)
DBInvalidArgError: (22, 'Invalid argument -- Berkeley DB library configured to support only private environments')

======================================================================
ERROR: test02 (bsddb.test.test_dbtables.TableDBTestCase)
----------------------------------------------------------------------

Traceback (most recent call last):
  File "/home/pybot/buildarea/2.5.klose-ubuntu-hppa/build/Lib/bsddb/test/test_dbtables.py", line 52, in setUp
    filename='tabletest.db', dbhome=homeDir, create=1)
  File "/home/pybot/buildarea/2.5.klose-ubuntu-hppa/build/Lib/bsddb/dbtables.py", line 161, in __init__
    self.env.open(dbhome, myflags | flagsforenv)
DBInvalidArgError: (22, 'Invalid argument -- Berkeley DB library configured to support only private environments')

======================================================================
ERROR: test03 (bsddb.test.test_dbtables.TableDBTestCase)
----------------------------------------------------------------------

Traceback (most recent call last):
  File "/home/pybot/buildarea/2.5.klose-ubuntu-hppa/build/Lib/bsddb/test/test_dbtables.py", line 52, in setUp
    filename='tabletest.db', dbhome=homeDir, create=1)
  File "/home/pybot/buildarea/2.5.klose-ubuntu-hppa/build/Lib/bsddb/dbtables.py", line 161, in __init__
    self.env.open(dbhome, myflags | flagsforenv)
DBInvalidArgError: (22, 'Invalid argument -- Berkeley DB library configured to support only private environments')

======================================================================
ERROR: test04_MultiCondSelect (bsddb.test.test_dbtables.TableDBTestCase)
----------------------------------------------------------------------

Traceback (most recent call last):
  File "/home/pybot/buildarea/2.5.klose-ubuntu-hppa/build/Lib/bsddb/test/test_dbtables.py", line 52, in setUp
    filename='tabletest.db', dbhome=homeDir, create=1)
  File "/home/pybot/buildarea/2.5.klose-ubuntu-hppa/build/Lib/bsddb/dbtables.py", line 161, in __init__
    self.env.open(dbhome, myflags | flagsforenv)
DBInvalidArgError: (22, 'Invalid argument -- Berkeley DB library configured to support only private environments')

======================================================================
ERROR: test_CondObjs (bsddb.test.test_dbtables.TableDBTestCase)
----------------------------------------------------------------------

Traceback (most recent call last):
  File "/home/pybot/buildarea/2.5.klose-ubuntu-hppa/build/Lib/bsddb/test/test_dbtables.py", line 52, in setUp
    filename='tabletest.db', dbhome=homeDir, create=1)
  File "/home/pybot/buildarea/2.5.klose-ubuntu-hppa/build/Lib/bsddb/dbtables.py", line 161, in __init__
    self.env.open(dbhome, myflags | flagsforenv)
DBInvalidArgError: (22, 'Invalid argument -- Berkeley DB library configured to support only private environments')

======================================================================
ERROR: test_CreateOrExtend (bsddb.test.test_dbtables.TableDBTestCase)
----------------------------------------------------------------------

Traceback (most recent call last):
  File "/home/pybot/buildarea/2.5.klose-ubuntu-hppa/build/Lib/bsddb/test/test_dbtables.py", line 52, in setUp
    filename='tabletest.db', dbhome=homeDir, create=1)
  File "/home/pybot/buildarea/2.5.klose-ubuntu-hppa/build/Lib/bsddb/dbtables.py", line 161, in __init__
    self.env.open(dbhome, myflags | flagsforenv)
DBInvalidArgError: (22, 'Invalid argument -- Berkeley DB library configured to support only private environments')

======================================================================
ERROR: test_Delete (bsddb.test.test_dbtables.TableDBTestCase)
----------------------------------------------------------------------

Traceback (most recent call last):
  File "/home/pybot/buildarea/2.5.klose-ubuntu-hppa/build/Lib/bsddb/test/test_dbtables.py", line 52, in setUp
    filename='tabletest.db', dbhome=homeDir, create=1)
  File "/home/pybot/buildarea/2.5.klose-ubuntu-hppa/build/Lib/bsddb/dbtables.py", line 161, in __init__
    self.env.open(dbhome, myflags | flagsforenv)
DBInvalidArgError: (22, 'Invalid argument -- Berkeley DB library configured to support only private environments')

======================================================================
ERROR: test_Modify (bsddb.test.test_dbtables.TableDBTestCase)
----------------------------------------------------------------------

Traceback (most recent call last):
  File "/home/pybot/buildarea/2.5.klose-ubuntu-hppa/build/Lib/bsddb/test/test_dbtables.py", line 52, in setUp
    filename='tabletest.db', dbhome=homeDir, create=1)
  File "/home/pybot/buildarea/2.5.klose-ubuntu-hppa/build/Lib/bsddb/dbtables.py", line 161, in __init__
    self.env.open(dbhome, myflags | flagsforenv)
DBInvalidArgError: (22, 'Invalid argument -- Berkeley DB library configured to support only private environments')

======================================================================
ERROR: test01_close_dbenv_before_db (bsddb.test.test_env_close.DBEnvClosedEarlyCrash)
----------------------------------------------------------------------

Traceback (most recent call last):
  File "/home/pybot/buildarea/2.5.klose-ubuntu-hppa/build/Lib/bsddb/test/test_env_close.py", line 53, in test01_close_dbenv_before_db
    0666)
DBInvalidArgError: (22, 'Invalid argument -- Berkeley DB library configured to support only private environments')

======================================================================
ERROR: test02_close_dbenv_delete_db_success (bsddb.test.test_env_close.DBEnvClosedEarlyCrash)
----------------------------------------------------------------------

Traceback (most recent call last):
  File "/home/pybot/buildarea/2.5.klose-ubuntu-hppa/build/Lib/bsddb/test/test_env_close.py", line 78, in test02_close_dbenv_delete_db_success
    0666)
DBInvalidArgError: (22, 'Invalid argument -- Berkeley DB library configured to support only private environments')

======================================================================
ERROR: test01_join (bsddb.test.test_join.JoinTestCase)
----------------------------------------------------------------------

Traceback (most recent call last):
  File "/home/pybot/buildarea/2.5.klose-ubuntu-hppa/build/Lib/bsddb/test/test_join.py", line 57, in setUp
    self.env.open(homeDir, db.DB_CREATE | db.DB_INIT_MPOOL | db.DB_INIT_LOCK )
DBInvalidArgError: (22, 'Invalid argument -- Berkeley DB library configured to support only private environments')

======================================================================
ERROR: test01_simple (bsddb.test.test_lock.LockingTestCase)
----------------------------------------------------------------------

Traceback (most recent call last):
  File "/home/pybot/buildarea/2.5.klose-ubuntu-hppa/build/Lib/bsddb/test/test_lock.py", line 39, in setUp
    db.DB_INIT_LOCK | db.DB_CREATE)
DBInvalidArgError: (22, 'Invalid argument -- Berkeley DB library configured to support only private environments')

======================================================================
ERROR: test02_threaded (bsddb.test.test_lock.LockingTestCase)
----------------------------------------------------------------------

Traceback (most recent call last):
  File "/home/pybot/buildarea/2.5.klose-ubuntu-hppa/build/Lib/bsddb/test/test_lock.py", line 39, in setUp
    db.DB_INIT_LOCK | db.DB_CREATE)
DBInvalidArgError: (22, 'Invalid argument -- Berkeley DB library configured to support only private environments')

======================================================================
ERROR: test03_set_timeout (bsddb.test.test_lock.LockingTestCase)
----------------------------------------------------------------------

Traceback (most recent call last):
  File "/home/pybot/buildarea/2.5.klose-ubuntu-hppa/build/Lib/bsddb/test/test_lock.py", line 39, in setUp
    db.DB_INIT_LOCK | db.DB_CREATE)
DBInvalidArgError: (22, 'Invalid argument -- Berkeley DB library configured to support only private environments')

======================================================================
ERROR: test02_db_home (bsddb.test.test_misc.MiscTestCase)
----------------------------------------------------------------------

Traceback (most recent call last):
  File "/home/pybot/buildarea/2.5.klose-ubuntu-hppa/build/Lib/bsddb/test/test_misc.py", line 44, in test02_db_home
    env.open(self.homeDir, db.DB_CREATE)
DBInvalidArgError: (22, 'Invalid argument -- Berkeley DB library configured to support only private environments')

======================================================================
ERROR: test02_WithSource (bsddb.test.test_recno.SimpleRecnoTestCase)
----------------------------------------------------------------------

Traceback (most recent call last):
  File "/home/pybot/buildarea/2.5.klose-ubuntu-hppa/build/Lib/bsddb/test/test_recno.py", line 210, in test02_WithSource
    f = open(source, 'w') # create the file
IOError: [Errno 2] No such file or directory: './Lib/test/db_home/test_recno.txt'

======================================================================
ERROR: test02_WithSource (bsddb.test.test_recno.SimpleRecnoTestCase)
----------------------------------------------------------------------

Traceback (most recent call last):
  File "/home/pybot/buildarea/2.5.klose-ubuntu-hppa/build/Lib/bsddb/test/test_recno.py", line 31, in tearDown
    os.remove(self.filename)
OSError: [Errno 2] No such file or directory: '/tmp/tmpwovT5R'

======================================================================
ERROR: test01_1WriterMultiReaders (bsddb.test.test_thread.BTreeConcurrentDataStore)
----------------------------------------------------------------------

Traceback (most recent call last):
  File "/home/pybot/buildarea/2.5.klose-ubuntu-hppa/build/Lib/bsddb/test/test_thread.py", line 64, in setUp
    self.env.open(homeDir, self.envflags | db.DB_CREATE)
DBInvalidArgError: (22, 'Invalid argument -- Berkeley DB library configured to support only private environments')

======================================================================
ERROR: test01_1WriterMultiReaders (bsddb.test.test_thread.HashConcurrentDataStore)
----------------------------------------------------------------------

Traceback (most recent call last):
  File "/home/pybot/buildarea/2.5.klose-ubuntu-hppa/build/Lib/bsddb/test/test_thread.py", line 64, in setUp
    self.env.open(homeDir, self.envflags | db.DB_CREATE)
DBInvalidArgError: (22, 'Invalid argument -- Berkeley DB library configured to support only private environments')

======================================================================
ERROR: test02_SimpleLocks (bsddb.test.test_thread.BTreeSimpleThreaded)
----------------------------------------------------------------------

Traceback (most recent call last):
  File "/home/pybot/buildarea/2.5.klose-ubuntu-hppa/build/Lib/bsddb/test/test_thread.py", line 64, in setUp
    self.env.open(homeDir, self.envflags | db.DB_CREATE)
DBInvalidArgError: (22, 'Invalid argument -- Berkeley DB library configured to support only private environments')

======================================================================
ERROR: test02_SimpleLocks (bsddb.test.test_thread.HashSimpleThreaded)
----------------------------------------------------------------------

Traceback (most recent call last):
  File "/home/pybot/buildarea/2.5.klose-ubuntu-hppa/build/Lib/bsddb/test/test_thread.py", line 64, in setUp
    self.env.open(homeDir, self.envflags | db.DB_CREATE)
DBInvalidArgError: (22, 'Invalid argument -- Berkeley DB library configured to support only private environments')

======================================================================
ERROR: test03_ThreadedTransactions (bsddb.test.test_thread.BTreeThreadedTransactions)
----------------------------------------------------------------------

Traceback (most recent call last):
  File "/home/pybot/buildarea/2.5.klose-ubuntu-hppa/build/Lib/bsddb/test/test_thread.py", line 64, in setUp
    self.env.open(homeDir, self.envflags | db.DB_CREATE)
DBInvalidArgError: (22, 'Invalid argument -- Berkeley DB library configured to support only private environments')

======================================================================
ERROR: test03_ThreadedTransactions (bsddb.test.test_thread.HashThreadedTransactions)
----------------------------------------------------------------------

Traceback (most recent call last):
  File "/home/pybot/buildarea/2.5.klose-ubuntu-hppa/build/Lib/bsddb/test/test_thread.py", line 64, in setUp
    self.env.open(homeDir, self.envflags | db.DB_CREATE)
DBInvalidArgError: (22, 'Invalid argument -- Berkeley DB library configured to support only private environments')

======================================================================
ERROR: test03_ThreadedTransactions (bsddb.test.test_thread.BTreeThreadedNoWaitTransactions)
----------------------------------------------------------------------

Traceback (most recent call last):
  File "/home/pybot/buildarea/2.5.klose-ubuntu-hppa/build/Lib/bsddb/test/test_thread.py", line 64, in setUp
    self.env.open(homeDir, self.envflags | db.DB_CREATE)
DBInvalidArgError: (22, 'Invalid argument -- Berkeley DB library configured to support only private environments')

======================================================================
ERROR: test03_ThreadedTransactions (bsddb.test.test_thread.HashThreadedNoWaitTransactions)
----------------------------------------------------------------------

Traceback (most recent call last):
  File "/home/pybot/buildarea/2.5.klose-ubuntu-hppa/build/Lib/bsddb/test/test_thread.py", line 64, in setUp
    self.env.open(homeDir, self.envflags | db.DB_CREATE)
DBInvalidArgError: (22, 'Invalid argument -- Berkeley DB library configured to support only private environments')

======================================================================
ERROR: test_cachesize (bsddb.test.test_sequence.DBSequenceTest)
----------------------------------------------------------------------

Traceback (most recent call last):
  File "/home/pybot/buildarea/2.5.klose-ubuntu-hppa/build/Lib/bsddb/test/test_sequence.py", line 29, in setUp
    self.dbenv.open(self.homeDir, db.DB_CREATE | db.DB_INIT_MPOOL, 0666)
DBInvalidArgError: (22, 'Invalid argument -- Berkeley DB library configured to support only private environments')

======================================================================
ERROR: test_flags (bsddb.test.test_sequence.DBSequenceTest)
----------------------------------------------------------------------

Traceback (most recent call last):
  File "/home/pybot/buildarea/2.5.klose-ubuntu-hppa/build/Lib/bsddb/test/test_sequence.py", line 29, in setUp
    self.dbenv.open(self.homeDir, db.DB_CREATE | db.DB_INIT_MPOOL, 0666)
DBInvalidArgError: (22, 'Invalid argument -- Berkeley DB library configured to support only private environments')

======================================================================
ERROR: test_get (bsddb.test.test_sequence.DBSequenceTest)
----------------------------------------------------------------------

Traceback (most recent call last):
  File "/home/pybot/buildarea/2.5.klose-ubuntu-hppa/build/Lib/bsddb/test/test_sequence.py", line 29, in setUp
    self.dbenv.open(self.homeDir, db.DB_CREATE | db.DB_INIT_MPOOL, 0666)
DBInvalidArgError: (22, 'Invalid argument -- Berkeley DB library configured to support only private environments')

======================================================================
ERROR: test_get_dbp (bsddb.test.test_sequence.DBSequenceTest)
----------------------------------------------------------------------

Traceback (most recent call last):
  File "/home/pybot/buildarea/2.5.klose-ubuntu-hppa/build/Lib/bsddb/test/test_sequence.py", line 29, in setUp
    self.dbenv.open(self.homeDir, db.DB_CREATE | db.DB_INIT_MPOOL, 0666)
DBInvalidArgError: (22, 'Invalid argument -- Berkeley DB library configured to support only private environments')

======================================================================
ERROR: test_get_key (bsddb.test.test_sequence.DBSequenceTest)
----------------------------------------------------------------------

Traceback (most recent call last):
  File "/home/pybot/buildarea/2.5.klose-ubuntu-hppa/build/Lib/bsddb/test/test_sequence.py", line 29, in setUp
    self.dbenv.open(self.homeDir, db.DB_CREATE | db.DB_INIT_MPOOL, 0666)
DBInvalidArgError: (22, 'Invalid argument -- Berkeley DB library configured to support only private environments')

======================================================================
ERROR: test_range (bsddb.test.test_sequence.DBSequenceTest)
----------------------------------------------------------------------

Traceback (most recent call last):
  File "/home/pybot/buildarea/2.5.klose-ubuntu-hppa/build/Lib/bsddb/test/test_sequence.py", line 29, in setUp
    self.dbenv.open(self.homeDir, db.DB_CREATE | db.DB_INIT_MPOOL, 0666)
DBInvalidArgError: (22, 'Invalid argument -- Berkeley DB library configured to support only private environments')

======================================================================
ERROR: test_remove (bsddb.test.test_sequence.DBSequenceTest)
----------------------------------------------------------------------

Traceback (most recent call last):
  File "/home/pybot/buildarea/2.5.klose-ubuntu-hppa/build/Lib/bsddb/test/test_sequence.py", line 29, in setUp
    self.dbenv.open(self.homeDir, db.DB_CREATE | db.DB_INIT_MPOOL, 0666)
DBInvalidArgError: (22, 'Invalid argument -- Berkeley DB library configured to support only private environments')

======================================================================
ERROR: test_stat (bsddb.test.test_sequence.DBSequenceTest)
----------------------------------------------------------------------

Traceback (most recent call last):
  File "/home/pybot/buildarea/2.5.klose-ubuntu-hppa/build/Lib/bsddb/test/test_sequence.py", line 29, in setUp
    self.dbenv.open(self.homeDir, db.DB_CREATE | db.DB_INIT_MPOOL, 0666)
DBInvalidArgError: (22, 'Invalid argument -- Berkeley DB library configured to support only private environments')

======================================================================
ERROR: test_pget (bsddb.test.test_cursor_pget_bug.pget_bugTestCase)
----------------------------------------------------------------------

Traceback (most recent call last):
  File "/home/pybot/buildarea/2.5.klose-ubuntu-hppa/build/Lib/bsddb/test/test_cursor_pget_bug.py", line 25, in setUp
    self.env.open(self.homeDir, db.DB_CREATE | db.DB_INIT_MPOOL)
DBInvalidArgError: (22, 'Invalid argument -- Berkeley DB library configured to support only private environments')

Traceback (most recent call last):
  File "./Lib/test/regrtest.py", line 549, in runtest_inner
    the_package = __import__(abstest, globals(), locals(), [])
  File "/home/pybot/buildarea/2.5.klose-ubuntu-hppa/build/Lib/test/test_resource.py", line 42, in <module>
    f.close()
IOError: [Errno 27] File too large

make: *** [buildbottest] Error 1

sincerely,
 -The Buildbot



More information about the Python-checkins mailing list