[Python-checkins] buildbot failure in i386 Ubuntu 3.0
buildbot at python.org
buildbot at python.org
Mon Aug 18 03:34:24 CEST 2008
The Buildbot has detected a new failure of i386 Ubuntu 3.0.
Full details are available at:
http://www.python.org/dev/buildbot/all/i386%20Ubuntu%203.0/builds/276
Buildbot URL: http://www.python.org/dev/buildbot/all/
Buildslave for this Build: klose-ubuntu-i386
Build Reason:
Build Source Stamp: [branch branches/py3k] HEAD
Blamelist: brett.cannon,gregory.p.smith
BUILD FAILED: failed test
Excerpt from the test logfile:
1 test failed:
test___all__
======================================================================
ERROR: test_all (test.test___all__.AllTest)
----------------------------------------------------------------------
Traceback (most recent call last):
File "/home/pybot/buildarea/3.0.klose-ubuntu-i386/build/Lib/test/test___all__.py", line 95, in test_all
self.check_all("os")
File "/home/pybot/buildarea/3.0.klose-ubuntu-i386/build/Lib/test/test___all__.py", line 23, in check_all
exec("from %s import *" % modname, names)
File "<string>", line 1, in <module>
AttributeError: 'module' object has no attribute 'extsep'
make: *** [buildbottest] Error 1
sincerely,
-The Buildbot
More information about the Python-checkins
mailing list