[Python-checkins] buildbot failure in sparc Ubuntu trunk

buildbot at python.org buildbot at python.org
Fri Feb 8 00:44:46 CET 2008

The Buildbot has detected a new failure of sparc Ubuntu trunk.
Full details are available at:

Buildbot URL: http://www.python.org/dev/buildbot/all/

Buildslave for this Build: klose-ubuntu-sparc

Build Reason: 
Build Source Stamp: [branch trunk] HEAD
Blamelist: facundo.batista,walter.doerwald

BUILD FAILED: failed test

Excerpt from the test logfile:
1 test failed:

FAIL: test_compact_freelists (test.test_sys.SysModuleTest)

Traceback (most recent call last):
  File "/home/pybot/buildarea/trunk.klose-ubuntu-sparc/build/Lib/test/test_sys.py", line 385, in test_compact_freelists
    self.assert_(r[0][2] > 100, r[0][2])
AssertionError: 0

make: *** [buildbottest] Error 1

 -The Buildbot

More information about the Python-checkins mailing list