[Python-checkins] buildbot failure in x86 gentoo trunk

buildbot at python.org buildbot at python.org
Fri Feb 8 02:22:27 CET 2008

The Buildbot has detected a new failure of x86 gentoo trunk.
Full details are available at:

Buildbot URL: http://www.python.org/dev/buildbot/all/

Buildslave for this Build: norwitz-x86

Build Reason: 
Build Source Stamp: [branch trunk] HEAD
Blamelist: amaury.forgeotdarc

BUILD FAILED: failed test

Excerpt from the test logfile:
1 test failed:

FAIL: test_compact_freelists (test.test_sys.SysModuleTest)

Traceback (most recent call last):
  File "/home/buildslave/python-trunk/trunk.norwitz-x86/build/Lib/test/test_sys.py", line 385, in test_compact_freelists
    self.assert_(r[0][2] > 100, r[0][2])
AssertionError: 0

make: *** [buildbottest] Error 1

 -The Buildbot

More information about the Python-checkins mailing list