[Python-checkins] buildbot failure in amd64 gentoo 3.0

buildbot at python.org buildbot at python.org
Wed Jun 4 15:43:52 CEST 2008

The Buildbot has detected a new failure of amd64 gentoo 3.0.
Full details are available at:

Buildbot URL: http://www.python.org/dev/buildbot/all/

Buildslave for this Build: norwitz-amd64

Build Reason: 
Build Source Stamp: [branch branches/py3k] HEAD
Blamelist: georg.brandl

BUILD FAILED: failed test

Excerpt from the test logfile:
1 test failed:

FAIL: test_sys_flags (test.test_sys.SysModuleTest)

Traceback (most recent call last):
  File "/home/buildbot/slave/py-build/3.0.norwitz-amd64/build/Lib/test/test_sys.py", line 330, in test_sys_flags
    self.assert_(hasattr(sys.flags, attr), attr)
AssertionError: tabcheck

make: *** [buildbottest] Error 1

 -The Buildbot

More information about the Python-checkins mailing list