[Python-checkins] buildbot failure in amd64 gentoo trunk

buildbot at python.org buildbot at python.org
Mon Jun 9 11:56:22 CEST 2008

The Buildbot has detected a new failure of amd64 gentoo trunk.
Full details are available at:

Buildbot URL: http://www.python.org/dev/buildbot/all/

Buildslave for this Build: norwitz-amd64

Build Reason: 
Build Source Stamp: [branch trunk] HEAD
Blamelist: raymond.hettinger

BUILD FAILED: failed test

Excerpt from the test logfile:
1 test failed:

FAIL: testSum (test.test_math.MathTests)

Traceback (most recent call last):
  File "/home/buildbot/slave/py-build/trunk.norwitz-amd64/build/Lib/test/test_math.py", line 770, in testSum
    (i, m, s.__name__, vals))
AssertionError: test 3 failed: got 1e+308, expected 'OverflowError' for math.sum([1e+308, 1e+308, -1e+308])

make: *** [buildbottest] Error 1

 -The Buildbot

More information about the Python-checkins mailing list