[Python-checkins] buildbot failure in ia64 Ubuntu trunk

buildbot at python.org buildbot at python.org
Wed Jun 18 19:29:56 CEST 2008


The Buildbot has detected a new failure of ia64 Ubuntu trunk.
Full details are available at:
 http://www.python.org/dev/buildbot/all/ia64%20Ubuntu%20trunk/builds/204

Buildbot URL: http://www.python.org/dev/buildbot/all/

Buildslave for this Build: klose-debian-ia64

Build Reason: 
Build Source Stamp: [branch trunk] HEAD
Blamelist: jesse.noller

BUILD FAILED: failed test

Excerpt from the test logfile:
1 test failed:
    test_socket_ssl

======================================================================
ERROR: testBasic (test.test_socket_ssl.ConnectedTests)
----------------------------------------------------------------------

Traceback (most recent call last):
  File "/home/pybot/buildarea/trunk.klose-debian-ia64/build/Lib/test/test_socket_ssl.py", line 51, in testBasic
    f = self.urlopen('https://sf.net')
  File "/home/pybot/buildarea/trunk.klose-debian-ia64/build/Lib/test/test_socket_ssl.py", line 38, in urlopen
    raise last_exc
IOError: [Errno socket error] [Errno 8] _ssl.c:1276: EOF occurred in violation of protocol

make: *** [buildbottest] Error 1

sincerely,
 -The Buildbot



More information about the Python-checkins mailing list