[Python-checkins] buildbot failure in x86 OpenBSD trunk

buildbot at python.org buildbot at python.org
Thu Jun 26 23:26:52 CEST 2008


The Buildbot has detected a new failure of x86 OpenBSD trunk.
Full details are available at:
 http://www.python.org/dev/buildbot/all/x86%20OpenBSD%20trunk/builds/48

Buildbot URL: http://www.python.org/dev/buildbot/all/

Buildslave for this Build: cortesi

Build Reason: The web-page 'rebuild' button was pressed by '<unknown>': <no reason specified>

Build Source Stamp: [branch trunk] HEAD
Blamelist: robert.schuppenies

BUILD FAILED: failed test

Excerpt from the test logfile:
5 tests failed:
    test_httpservers test_kqueue test_math test_signal test_ssl

======================================================================
ERROR: test_authorization (test.test_httpservers.CGIHTTPServerTestCase)
----------------------------------------------------------------------

Traceback (most recent call last):
  File "/home/buildbot/buildbot/trunk.cortesi/build/Lib/test/test_httpservers.py", line 338, in test_authorization
    res = self.request('/cgi-bin/file1.py', 'GET', headers=headers)
  File "/home/buildbot/buildbot/trunk.cortesi/build/Lib/test/test_httpservers.py", line 64, in request
    return self.connection.getresponse()
  File "/home/buildbot/buildbot/trunk.cortesi/build/Lib/httplib.py", line 945, in getresponse
    response.begin()
  File "/home/buildbot/buildbot/trunk.cortesi/build/Lib/httplib.py", line 414, in begin
    self.msg = HTTPMessage(self.fp, 0)
  File "/home/buildbot/buildbot/trunk.cortesi/build/Lib/mimetools.py", line 19, in __init__
    rfc822.Message.__init__(self, fp, seekable)
  File "/home/buildbot/buildbot/trunk.cortesi/build/Lib/rfc822.py", line 107, in __init__
    self.readheaders()
  File "/home/buildbot/buildbot/trunk.cortesi/build/Lib/httplib.py", line 270, in readheaders
    line = self.fp.readline()
  File "/home/buildbot/buildbot/trunk.cortesi/build/Lib/socket.py", line 395, in readline
    data = recv(1)
error: [Errno 4] Interrupted system call

======================================================================
ERROR: test_headers_and_content (test.test_httpservers.CGIHTTPServerTestCase)
----------------------------------------------------------------------

Traceback (most recent call last):
  File "/home/buildbot/buildbot/trunk.cortesi/build/Lib/test/test_httpservers.py", line 319, in test_headers_and_content
    res = self.request('/cgi-bin/file1.py')
  File "/home/buildbot/buildbot/trunk.cortesi/build/Lib/test/test_httpservers.py", line 64, in request
    return self.connection.getresponse()
  File "/home/buildbot/buildbot/trunk.cortesi/build/Lib/httplib.py", line 945, in getresponse
    response.begin()
  File "/home/buildbot/buildbot/trunk.cortesi/build/Lib/httplib.py", line 414, in begin
    self.msg = HTTPMessage(self.fp, 0)
  File "/home/buildbot/buildbot/trunk.cortesi/build/Lib/mimetools.py", line 19, in __init__
    rfc822.Message.__init__(self, fp, seekable)
  File "/home/buildbot/buildbot/trunk.cortesi/build/Lib/rfc822.py", line 107, in __init__
    self.readheaders()
  File "/home/buildbot/buildbot/trunk.cortesi/build/Lib/httplib.py", line 270, in readheaders
    line = self.fp.readline()
  File "/home/buildbot/buildbot/trunk.cortesi/build/Lib/socket.py", line 395, in readline
    data = recv(1)
error: [Errno 4] Interrupted system call

======================================================================
ERROR: test_post (test.test_httpservers.CGIHTTPServerTestCase)
----------------------------------------------------------------------

Traceback (most recent call last):
  File "/home/buildbot/buildbot/trunk.cortesi/build/Lib/test/test_httpservers.py", line 328, in test_post
    self.assertEquals(res.read(), '1, python, 123456\n')
  File "/home/buildbot/buildbot/trunk.cortesi/build/Lib/httplib.py", line 517, in read
    s = self.fp.read()
  File "/home/buildbot/buildbot/trunk.cortesi/build/Lib/socket.py", line 327, in read
    data = self._sock.recv(rbufsize)
error: [Errno 4] Interrupted system call

======================================================================
FAIL: test_queue_event (test.test_kqueue.TestKQueue)
----------------------------------------------------------------------

Traceback (most recent call last):
  File "/home/buildbot/buildbot/trunk.cortesi/build/Lib/test/test_kqueue.py", line 118, in test_queue_event
    (server.fileno(), select.KQ_FILTER_WRITE, flags)])
AssertionError: [(18L, -2, 5L), (20L, -2, 5L)] != [(18, -2, 0), (20, -2, 0)]

======================================================================
FAIL: testLog (test.test_math.MathTests)
----------------------------------------------------------------------

Traceback (most recent call last):
  File "/home/buildbot/buildbot/trunk.cortesi/build/Lib/test/test_math.py", line 419, in testLog
    self.assertRaises(ValueError, math.log, NINF)
AssertionError: ValueError not raised

======================================================================
FAIL: testLog10 (test.test_math.MathTests)
----------------------------------------------------------------------

Traceback (most recent call last):
  File "/home/buildbot/buildbot/trunk.cortesi/build/Lib/test/test_math.py", line 441, in testLog10
    self.assertRaises(ValueError, math.log10, NINF)
AssertionError: ValueError not raised

======================================================================
FAIL: test_siginterrupt_off (test.test_signal.SiginterruptTest)
----------------------------------------------------------------------

Traceback (most recent call last):
  File "/home/buildbot/buildbot/trunk.cortesi/build/Lib/test/test_signal.py", line 295, in test_siginterrupt_off
    self.assertEquals(i, False)
AssertionError: True != False

======================================================================
FAIL: test_itimer_prof (test.test_signal.ItimerTest)
----------------------------------------------------------------------

Traceback (most recent call last):
  File "/home/buildbot/buildbot/trunk.cortesi/build/Lib/test/test_signal.py", line 382, in test_itimer_prof
    self.assertEquals(signal.getitimer(self.itimer), (0.0, 0.0))
AssertionError: (0.059999999999999998, 0.20000000000000001) != (0.0, 0.0)

======================================================================
FAIL: test_itimer_virtual (test.test_signal.ItimerTest)
----------------------------------------------------------------------

Traceback (most recent call last):
  File "/home/buildbot/buildbot/trunk.cortesi/build/Lib/test/test_signal.py", line 368, in test_itimer_virtual
    self.assertEquals(signal.getitimer(self.itimer), (0.0, 0.0))
AssertionError: (0.0, 0.01) != (0.0, 0.0)

sincerely,
 -The Buildbot



More information about the Python-checkins mailing list