[Python-checkins] buildbot failure in PPC64 Debian trunk

buildbot at python.org buildbot at python.org
Tue Mar 18 15:17:36 CET 2008


The Buildbot has detected a new failure of PPC64 Debian trunk.
Full details are available at:
 http://www.python.org/dev/buildbot/all/PPC64%20Debian%20trunk/builds/519

Buildbot URL: http://www.python.org/dev/buildbot/all/

Buildslave for this Build: klose-debian-ppc64

Build Reason: 
Build Source Stamp: [branch trunk] HEAD
Blamelist: martin.v.loewis

BUILD FAILED: failed test

Excerpt from the test logfile:
1 test failed:
    test_socket_ssl

Traceback (most recent call last):
  File "./Lib/test/regrtest.py", line 563, in runtest_inner
    test_times.append((test_time, test))
AttributeError: 'NoneType' object has no attribute 'append'

make: *** [buildbottest] Error 1

sincerely,
 -The Buildbot



More information about the Python-checkins mailing list