[Python-checkins] buildbot failure in AMD64 W2k8 trunk

buildbot at python.org buildbot at python.org
Tue Nov 25 05:37:16 CET 2008


The Buildbot has detected a new failure of AMD64 W2k8 trunk.
Full details are available at:
 http://www.python.org/dev/buildbot/all/AMD64%20W2k8%20trunk/builds/1085

Buildbot URL: http://www.python.org/dev/buildbot/all/

Buildslave for this Build: nelson-win64

Build Reason: 
Build Source Stamp: [branch trunk] HEAD
Blamelist: benjamin.peterson

BUILD FAILED: failed test

Excerpt from the test logfile:
1 test failed:
    test_bsddb3

======================================================================
ERROR: test01_basic_replication (bsddb.test.test_replication.DBReplicationManager)
----------------------------------------------------------------------

Traceback (most recent call last):
  File "S:\buildbots\python.x64\trunk.nelson-win64\build\lib\bsddb\test\test_replication.py", line 170, in test01_basic_replication
    mode=0666, txn=txn)
DBNoSuchFileError: (2, 'No such file or directory -- connection closed: Unknown error')

======================================================================
ERROR: test01_basic_replication (bsddb.test.test_replication.DBReplicationManager)
----------------------------------------------------------------------

Traceback (most recent call last):
  File "S:\buildbots\python.x64\trunk.nelson-win64\build\lib\bsddb\test\test_replication.py", line 58, in tearDown
    if self.dbClient :
DBError: (0, 'DB object has been closed')

======================================================================
FAIL: test01_basic_replication (bsddb.test.test_replication.DBBaseReplication)
----------------------------------------------------------------------

Traceback (most recent call last):
  File "S:\buildbots\python.x64\trunk.nelson-win64\build\lib\bsddb\test\test_replication.py", line 315, in test01_basic_replication
    self.assertTrue(time.time()<timeout)
AssertionError

sincerely,
 -The Buildbot



More information about the Python-checkins mailing list