[Python-checkins] buildbot failure in ppc Debian unstable 3.0

buildbot at python.org buildbot at python.org
Wed Sep 10 16:34:06 CEST 2008

The Buildbot has detected a new failure of ppc Debian unstable 3.0.
Full details are available at:

Buildbot URL: http://www.python.org/dev/buildbot/all/

Buildslave for this Build: klose-debian-ppc

Build Reason: 
Build Source Stamp: [branch branches/py3k] HEAD
Blamelist: benjamin.peterson,georg.brandl,martin.v.loewis

BUILD FAILED: failed test

Excerpt from the test logfile:
Traceback (most recent call last):
  File "./Lib/test/regrtest.py", line 1198, in <module>
  File "./Lib/test/regrtest.py", line 411, in main
    testdir, huntrleaks)
  File "./Lib/test/regrtest.py", line 570, in runtest
    testdir, huntrleaks)
  File "./Lib/test/regrtest.py", line 623, in runtest_inner
    print("test", test, "failed --", msg)
  File "/home/pybot/buildarea/3.0.klose-debian-ppc/build/Lib/io.py", line 1486, in write
    b = encoder.encode(s)
  File "/home/pybot/buildarea/3.0.klose-debian-ppc/build/Lib/encodings/ascii.py", line 22, in encode
    return codecs.ascii_encode(input, self.errors)[0]
UnicodeEncodeError: 'ascii' codec can't encode character '\u0370' in position 373: ordinal not in range(128)

make: *** [buildbottest] Error 1

 -The Buildbot

More information about the Python-checkins mailing list