[Python-checkins] buildbot failure in sparc solaris10 gcc 3.x

buildbot at python.org buildbot at python.org
Sat Apr 11 18:02:42 CEST 2009


The Buildbot has detected a new failure of sparc solaris10 gcc 3.x.
Full details are available at:
 http://www.python.org/dev/buildbot/all/sparc%20solaris10%20gcc%203.x/builds/513

Buildbot URL: http://www.python.org/dev/buildbot/all/

Buildslave for this Build: loewis-sun

Build Reason: 
Build Source Stamp: [branch branches/py3k] HEAD
Blamelist: nick.coghlan,tarek.ziade

BUILD FAILED: failed test

Excerpt from the test logfile:
2 tests failed:
    test_importlib test_posix

Traceback (most recent call last):
  File "./Lib/test/regrtest.py", line 620, in runtest_inner
  File "/home2/buildbot/slave/3.x.loewis-sun/build/Lib/test/test_importlib.py", line 6, in test_main
    run_unittest(importlib.test.test_suite('importlib.test'))
  File "/home2/buildbot/slave/3.x.loewis-sun/build/Lib/importlib/test/__init__.py", line 22, in test_suite
    package_tests = getattr(sys.modules[package_name], 'test_suite')()
  File "/home2/buildbot/slave/3.x.loewis-sun/build/Lib/importlib/test/source/__init__.py", line 8, in test_suite
    return importlib.test.test_suite('importlib.test.source', directory)
  File "/home2/buildbot/slave/3.x.loewis-sun/build/Lib/importlib/test/__init__.py", line 16, in test_suite
    __import__(module_name, level=0)
  File "/home2/buildbot/slave/3.x.loewis-sun/build/Lib/importlib/test/source/test_case_sensitivity.py", line 12, in <module>
    class CaseSensitivityTest(unittest.TestCase):
  File "/home2/buildbot/slave/3.x.loewis-sun/build/Lib/importlib/test/util.py", line 13, in case_insensitive_tests
    original_name = os.listdir('.')[0]
IndexError: list index out of range

======================================================================
ERROR: test_getcwd_long_pathnames (test.test_posix.PosixTester)
----------------------------------------------------------------------

Traceback (most recent call last):
  File "/home2/buildbot/slave/3.x.loewis-sun/build/Lib/test/test_posix.py", line 249, in test_getcwd_long_pathnames
    support.rmtree(base_path)
  File "/home2/buildbot/slave/3.x.loewis-sun/build/Lib/test/support.py", line 143, in rmtree
    shutil.rmtree(path)
  File "/home2/buildbot/slave/3.x.loewis-sun/build/Lib/shutil.py", line 225, in rmtree
    onerror(os.rmdir, path, sys.exc_info())
  File "/home2/buildbot/slave/3.x.loewis-sun/build/Lib/shutil.py", line 223, in rmtree
    os.rmdir(path)
OSError: [Errno 22] Invalid argument: '/home2/buildbot/slave/3.x.loewis-sun/build/@test.getcwd/@test.getcwd'

sincerely,
 -The Buildbot



More information about the Python-checkins mailing list