[Python-checkins] buildbot failure in sparc solaris10 gcc 3.0

buildbot at python.org buildbot at python.org
Sat Feb 21 00:54:20 CET 2009


The Buildbot has detected a new failure of sparc solaris10 gcc 3.0.
Full details are available at:
 http://www.python.org/dev/buildbot/all/sparc%20solaris10%20gcc%203.0/builds/170

Buildbot URL: http://www.python.org/dev/buildbot/all/

Buildslave for this Build: loewis-sun

Build Reason: 
Build Source Stamp: [branch branches/release30-maint] HEAD
Blamelist: mark.dickinson

BUILD FAILED: failed test

Excerpt from the test logfile:
3 tests failed:
    test_posix test_smtplib test_subprocess

======================================================================
ERROR: test_getcwd_long_pathnames (test.test_posix.PosixTester)
----------------------------------------------------------------------

Traceback (most recent call last):
  File "/home2/buildbot/slave/3.0.loewis-sun/build/Lib/test/test_posix.py", line 252, in test_getcwd_long_pathnames
    support.rmtree(base_path)
  File "/home2/buildbot/slave/3.0.loewis-sun/build/Lib/test/support.py", line 98, in rmtree
    shutil.rmtree(path)
  File "/home2/buildbot/slave/3.0.loewis-sun/build/Lib/shutil.py", line 225, in rmtree
    onerror(os.rmdir, path, sys.exc_info())
  File "/home2/buildbot/slave/3.0.loewis-sun/build/Lib/shutil.py", line 223, in rmtree
    os.rmdir(path)
OSError: [Errno 22] Invalid argument: '/home2/buildbot/slave/3.0.loewis-sun/build/@test.getcwd/@test.getcwd'

======================================================================
FAIL: test_executable (test.test_subprocess.ProcessTestCase)
----------------------------------------------------------------------

Traceback (most recent call last):
  File "/home2/buildbot/slave/3.0.loewis-sun/build/Lib/test/test_subprocess.py", line 115, in test_executable
    self.assertEqual(p.returncode, 47)
AssertionError: -6 != 47

sincerely,
 -The Buildbot



More information about the Python-checkins mailing list