[Python-checkins] buildbot failure in amd64 gentoo trunk

buildbot at python.org buildbot at python.org
Sat Feb 21 21:56:39 CET 2009


The Buildbot has detected a new failure of amd64 gentoo trunk.
Full details are available at:
 http://www.python.org/dev/buildbot/all/amd64%20gentoo%20trunk/builds/1892

Buildbot URL: http://www.python.org/dev/buildbot/all/

Buildslave for this Build: norwitz-amd64

Build Reason: 
Build Source Stamp: [branch trunk] HEAD
Blamelist: georg.brandl,mark.dickinson

BUILD FAILED: failed test

Excerpt from the test logfile:
1 test failed:
    test_site

======================================================================
FAIL: test_s_option (test.test_site.HelperFunctionsTests)
----------------------------------------------------------------------

Traceback (most recent call last):
  File "/home/buildbot/slave/py-build/trunk.norwitz-amd64/build/Lib/test/test_site.py", line 105, in test_s_option
    self.assertEqual(rc, 1)
AssertionError: 0 != 1

make: *** [buildbottest] Error 1

sincerely,
 -The Buildbot



More information about the Python-checkins mailing list