[Python-checkins] buildbot failure in ppc Debian unstable 2.6

buildbot at python.org buildbot at python.org
Thu Mar 5 16:43:22 CET 2009


The Buildbot has detected a new failure of ppc Debian unstable 2.6.
Full details are available at:
 http://www.python.org/dev/buildbot/all/ppc%20Debian%20unstable%202.6/builds/157

Buildbot URL: http://www.python.org/dev/buildbot/all/

Buildslave for this Build: klose-debian-ppc

Build Reason: 
Build Source Stamp: [branch branches/release26-maint] HEAD
Blamelist: hirokazu.yamamoto

BUILD FAILED: failed test

Excerpt from the test logfile:
1 test failed:
    test_bsddb3

======================================================================
FAIL: test01_basic_replication (bsddb.test.test_replication.DBReplicationManager)
----------------------------------------------------------------------

Traceback (most recent call last):
  File "/home/pybot/buildarea/2.6.klose-debian-ppc/build/Lib/bsddb/test/test_replication.py", line 134, in test01_basic_replication
    self.assertTrue(time.time()<timeout)
AssertionError

make: *** [buildbottest] Error 1

sincerely,
 -The Buildbot



More information about the Python-checkins mailing list