[Python-checkins] buildbot failure in ppc Debian unstable 3.x

buildbot at python.org buildbot at python.org
Tue Mar 24 02:33:26 CET 2009


The Buildbot has detected a new failure of ppc Debian unstable 3.x.
Full details are available at:
 http://www.python.org/dev/buildbot/all/ppc%20Debian%20unstable%203.x/builds/483

Buildbot URL: http://www.python.org/dev/buildbot/all/

Buildslave for this Build: klose-debian-ppc

Build Reason: 
Build Source Stamp: [branch branches/py3k] HEAD
Blamelist: benjamin.peterson,raymond.hettinger

BUILD FAILED: failed test

Excerpt from the test logfile:
1 test failed:
    test___all__

======================================================================
ERROR: test_all (test.test___all__.AllTest)
----------------------------------------------------------------------

Traceback (most recent call last):
  File "/home/pybot/buildarea/3.x.klose-debian-ppc/build/Lib/test/test___all__.py", line 136, in test_all
    self.check_all("unittest")
  File "/home/pybot/buildarea/3.x.klose-debian-ppc/build/Lib/test/test___all__.py", line 23, in check_all
    exec("from %s import *" % modname, names)
  File "<string>", line 1, in <module>
AttributeError: 'module' object has no attribute 'SkipException'

make: *** [buildbottest] Error 1

sincerely,
 -The Buildbot



More information about the Python-checkins mailing list